ciudadanointeligente / observatorio-news-spreadsheet-storage

Observatorio spreadsheet storage for news


observatorio-news-spreadsheet-storage

This is a data storage for Observatorio anti corrupción that runs on Morph. To get started see the documentation

Deploy & Installation

WIP

Everything else:

For more information about us, our site Fundación Ciudadano Inteligente. And if you want help with patches, report bugs or replicate our project check our repositories.

Contributors rezzo damian-garrido

Last run failed with status code 255.

Console output of last run

Injecting configuration and compiling...  -----> Ruby app detected -----> Compiling Ruby -----> Using Ruby version: ruby-2.3.4 -----> Installing dependencies using bundler 1.15.2  Running: bundle install --without development:test --path vendor/bundle --binstubs vendor/bundle/bin -j4 --deployment  Fetching gem metadata from https://rubygems.org/........  Fetching version metadata from https://rubygems.org/.  Fetching https://github.com/openaustralia/scraperwiki-ruby.git  Using bundler 1.15.2  Fetching httpclient 2.6.0.1  Fetching json 1.8.1  Fetching mini_portile 0.6.2  Installing mini_portile 0.6.2  Installing json 1.8.1 with native extensions  Fetching sqlite3 1.3.10  Installing httpclient 2.6.0.1  Installing sqlite3 1.3.10 with native extensions  Fetching nokogiri 1.6.6.2  Installing nokogiri 1.6.6.2 with native extensions  Fetching sqlite_magic 0.0.3  Installing sqlite_magic 0.0.3  Gem::Ext::BuildError: ERROR: Failed to build gem native extension.  current directory:  /tmp/build/vendor/bundle/ruby/2.3.0/gems/json-1.8.1/ext/json/ext/generator  /tmp/build/vendor/ruby-2.3.4/bin/ruby -r ./siteconf20180423-284-1ashz0z.rb  extconf.rb  creating Makefile  current directory:  /tmp/build/vendor/bundle/ruby/2.3.0/gems/json-1.8.1/ext/json/ext/generator  make "DESTDIR=" clean  current directory:  /tmp/build/vendor/bundle/ruby/2.3.0/gems/json-1.8.1/ext/json/ext/generator  make "DESTDIR="  compiling generator.c  In file included from generator.c:1:0:  ../fbuffer/fbuffer.h: In function ‘fbuffer_to_s’:  ../fbuffer/fbuffer.h:175:47: error: macro "rb_str_new" requires 2 arguments, but  only 1 given  VALUE result = rb_str_new(FBUFFER_PAIR(fb));  ^  ../fbuffer/fbuffer.h:175:20: warning: initialization makes integer from pointer  without a cast [enabled by default]  VALUE result = rb_str_new(FBUFFER_PAIR(fb));  ^  make: *** [generator.o] Error 1  make failed, exit code 2  Gem files will remain installed in  /tmp/build/vendor/bundle/ruby/2.3.0/gems/json-1.8.1 for inspection.  Results logged to  /tmp/build/vendor/bundle/ruby/2.3.0/extensions/x86_64-linux/2.3.0-static/json-1.8.1/gem_make.out  An error occurred while installing json (1.8.1), and Bundler cannot continue.  Make sure that `gem install json -v '1.8.1'` succeeds before bundling.  In Gemfile:  json  Bundler Output: Fetching gem metadata from https://rubygems.org/........  Fetching version metadata from https://rubygems.org/.  Fetching https://github.com/openaustralia/scraperwiki-ruby.git  Using bundler 1.15.2  Fetching httpclient 2.6.0.1  Fetching json 1.8.1  Fetching mini_portile 0.6.2  Installing mini_portile 0.6.2  Installing json 1.8.1 with native extensions  Fetching sqlite3 1.3.10  Installing httpclient 2.6.0.1  Installing sqlite3 1.3.10 with native extensions  Fetching nokogiri 1.6.6.2  Installing nokogiri 1.6.6.2 with native extensions  Fetching sqlite_magic 0.0.3  Installing sqlite_magic 0.0.3  Gem::Ext::BuildError: ERROR: Failed to build gem native extension.   current directory:  /tmp/build/vendor/bundle/ruby/2.3.0/gems/json-1.8.1/ext/json/ext/generator  /tmp/build/vendor/ruby-2.3.4/bin/ruby -r ./siteconf20180423-284-1ashz0z.rb  extconf.rb  creating Makefile   current directory:  /tmp/build/vendor/bundle/ruby/2.3.0/gems/json-1.8.1/ext/json/ext/generator  make "DESTDIR=" clean   current directory:  /tmp/build/vendor/bundle/ruby/2.3.0/gems/json-1.8.1/ext/json/ext/generator  make "DESTDIR="  compiling generator.c  In file included from generator.c:1:0:  ../fbuffer/fbuffer.h: In function ‘fbuffer_to_s’:  ../fbuffer/fbuffer.h:175:47: error: macro "rb_str_new" requires 2 arguments, but  only 1 given  VALUE result = rb_str_new(FBUFFER_PAIR(fb));  ^  ../fbuffer/fbuffer.h:175:20: warning: initialization makes integer from pointer  without a cast [enabled by default]  VALUE result = rb_str_new(FBUFFER_PAIR(fb));  ^  make: *** [generator.o] Error 1   make failed, exit code 2   Gem files will remain installed in  /tmp/build/vendor/bundle/ruby/2.3.0/gems/json-1.8.1 for inspection.  Results logged to  /tmp/build/vendor/bundle/ruby/2.3.0/extensions/x86_64-linux/2.3.0-static/json-1.8.1/gem_make.out   An error occurred while installing json (1.8.1), and Bundler cannot continue.  Make sure that `gem install json -v '1.8.1'` succeeds before bundling.   In Gemfile:  json  !  ! Failed to install gems via Bundler.  !

Data

Downloaded 42614 times by ciudadanointeligente damian-garrido lfalvarez jbci MikeRalphson jdgarrido mjosetapia

To download data sign in with GitHub

Download table (as CSV) Download SQLite database (788 KB) Use the API

rows 10 / 1036

uid date title summary tags source img highlighted last_update
1
2015-11-02
Partidos anticipan fuerte baja en número de afiliados
Dirigentes se preparan para afrontar la obligación de refichar a los militantes. Los cálculos internos apuntan a una baja de hasta el 70% de sus actuales padrones, lo que en algunos casos pone en riesgo el financiamiento estatal.
["nacional"]
2017-12-02
2
2015-11-02
Las trampas de la Ley del Lobby
A un año de su implementación, una de las normas definidas como clave para el sistema de transparencia está en entredicho. Expertos apuntan al menos a cinco zonas oscuras.
["nacional"]
2017-12-02
3
2015-11-02
Radiografía al refichaje de 621 mil militantes
Cifra corresponde a siete colectividades, que tienen más de 40 mil inscritos cada una.
["nacional"]
2017-12-02
4
2015-11-02
Destacan avances en transparencia del Congreso chileno
Vicepresidente de la Cámara, Patricio Vallespín, y senador Hernán Larraín participan en Cumbre Mundial sobre Gobiernos Abiertos en México.
["nacional"]
2017-12-02
5
2015-11-02
Diputados enfrentados por fiscalización del Servel a partidos políticos
Si bien los diputados miembros de la Comisión de Constitución coinciden en que es necesario que exista fiscalización externa a las colectividades, algunos manifiestan que las indicaciones a la Ley de Partidos lesionan la autonomía de las tiendas políticas.
["nacional"]
2017-12-02
6
2015-11-02
Ocde revisará agenda de probidad y transparencia del gobierno
Ministro Eyzaguirre oficializará mañana una solicitud para iniciar la evaluación.
["nacional"]
2017-12-02
7
2015-11-02
Ministro Díaz busca acercar posiciones para revertir rechazo de partidos a controles externos
Varias de las indicaciones del gobierno a la ley de partidos fueron rechazadas en la comisión de Constitución de la Cámara.
["nacional"]
2017-12-02
8
2015-11-02
La resistencia de los partidos al control del Estado
Tres propuestas del gobierno que aumentaban la regulación sobre las colectividades fueron rechazadas. Este es el detalle de las intervenciones en la Comisión de Constitución y los argumentos de los legisladores para oponerse.
["nacional"]
2017-12-02
9
2015-11-04
Diputados aprueban órdenes de partido y terminan con objeción de conciencia
Regirán en asuntos relativos a principios y programas de las colectividades, además de políticas de alianzas.
["nacional"]
2017-12-02
10
2015-11-04
Diputados ceden y exploran acuerdo para permitir control del Servel y Tricel en partidos
Se abrirían a que organismos puedan resolver objeciones a elecciones internas y entrega de información
["nacional"]
2017-12-02

Statistics

Average successful run time: 2 minutes

Total run time: 1 day

Total cpu time used: 27 minutes

Total disk space used: 969 KB

History

  • Auto ran revision 125c4b71 and failed .
    nothing changed in the database
  • Auto ran revision 125c4b71 and failed .
    nothing changed in the database
  • Auto ran revision 125c4b71 and failed .
    nothing changed in the database
  • Auto ran revision 125c4b71 and failed .
    nothing changed in the database
  • Auto ran revision 125c4b71 and failed .
    nothing changed in the database
  • ...
  • Created on morph.io

Show complete history