This is a scraper that runs on Morph. To get started see the documentation

Contributors woodbine blablupcom

Last run failed with status code 1.

Console output of last run

Injecting configuration and compiling...  -----> Python app detected -----> Installing python-2.7.14 -----> Installing pip -----> Installing requirements with pip  DEPRECATION: Python 2.7 reached the end of its life on January 1st, 2020. Please upgrade your Python as Python 2.7 is no longer maintained. pip 21.0 will drop support for Python 2.7 in January 2021. More details about Python 2 support in pip can be found at https://pip.pypa.io/en/latest/development/release-process/#python-2-support  Obtaining scraperwiki from git+http://github.com/openaustralia/scraperwiki-python.git@morph_defaults#egg=scraperwiki (from -r /tmp/build/requirements.txt (line 2))  Cloning http://github.com/openaustralia/scraperwiki-python.git (to revision morph_defaults) to /app/.heroku/src/scraperwiki  Collecting BeautifulSoup==3.2.0  Downloading BeautifulSoup-3.2.0.tar.gz (31 kB)  Collecting Creoleparser==0.7.4  Downloading Creoleparser-0.7.4.zip (31 kB)  Collecting Genshi==0.6  Downloading Genshi-0.6.tar.gz (433 kB)  Collecting Jinja2==2.6  Downloading Jinja2-2.6.tar.gz (389 kB)  Collecting Markdown==2.2.0  Downloading Markdown-2.2.0.tar.gz (236 kB)  Collecting Pygments==1.4  Downloading Pygments-1.4.tar.gz (3.5 MB)  Collecting SQLAlchemy==0.6.6  Downloading SQLAlchemy-0.6.6.tar.gz (2.1 MB)  Collecting Twisted==11.1.0  Downloading Twisted-11.1.0.tar.bz2 (2.8 MB)  Collecting Unidecode==0.04.9  Downloading Unidecode-0.04.9.tar.gz (196 kB)  Collecting anyjson==0.3.3  Downloading anyjson-0.3.3.tar.gz (8.3 kB)  Collecting argparse==1.2.1  Downloading argparse-1.2.1.tar.gz (69 kB)  Collecting beautifulsoup4==4.1.3  Downloading beautifulsoup4-4.1.3.tar.gz (58 kB)  Collecting bitlyapi==0.1.1  Downloading bitlyapi-0.1.1.tar.gz (4.3 kB)  Collecting blinker==1.2  Downloading blinker-1.2.tar.gz (66 kB)  Collecting cartodb==0.6  Downloading cartodb-0.6.tar.gz (3.6 kB)  Collecting certifi==0.0.8  Downloading certifi-0.0.8.tar.gz (118 kB)  Collecting chardet==2.1.1  Downloading chardet-2.1.1.tar.gz (178 kB)  Collecting ckanclient==0.10  Downloading ckanclient-0.10.tar.gz (16 kB)  Collecting colormath==1.0.8  Downloading colormath-1.0.8.tar.gz (24 kB)  Collecting csvkit==0.3.0  Downloading csvkit-0.3.0.tar.gz (23 kB)  Collecting dataset==0.5.2  Downloading dataset-0.5.2.tar.gz (14 kB)  Collecting demjson==1.6  Downloading demjson-1.6.tar.gz (64 kB)  Collecting dropbox==1.4  Downloading dropbox-1.4.tar.gz (33 kB)  Collecting errorhandler==1.1.1  Downloading errorhandler-1.1.1.tar.gz (8.3 kB)  Collecting feedparser==5.0.1  Downloading feedparser-5.0.1.tar.bz2 (204 kB)  Collecting fluidinfo.py==1.1.2  Downloading fluidinfo.py-1.1.2.tar.gz (4.7 kB)  Collecting gdata==2.0.15  Downloading gdata-2.0.15.tar.gz (2.0 MB)  Collecting geopy==0.94.1  Downloading geopy-0.94.1.tar.gz (27 kB)  Collecting gevent==0.13.6  Downloading gevent-0.13.6.tar.gz (289 kB)  Collecting google-api-python-client==1.0beta8  Downloading google-api-python-client-1.0beta8.tar.gz (348 kB)  Collecting googlemaps==1.0.2  Downloading googlemaps-1.0.2.tar.gz (60 kB)  Collecting greenlet==0.3.2  Downloading greenlet-0.3.2.zip (50 kB)  Collecting html5lib==0.90  Downloading html5lib-0.90.tar.gz (86 kB)  Collecting httplib2==0.7.4  Downloading httplib2-0.7.4.tar.gz (106 kB)  Collecting imposm.parser==1.0.3  Downloading imposm.parser-1.0.3.tar.gz (31 kB)  Collecting jellyfish==0.2.0  Downloading jellyfish-0.2.0.tar.gz (14 kB)  Collecting mechanize==0.2.5  Downloading mechanize-0.2.5.tar.gz (383 kB)  Collecting mock==0.7.2  Downloading mock-0.7.2.tar.gz (896 kB)  Collecting networkx==1.6  Downloading networkx-1.6.tar.gz (707 kB)  Collecting ngram==3.3.0  Downloading ngram-3.3.0.tar.gz (8.8 kB)  Collecting nose==1.1.2  Downloading nose-1.1.2.tar.gz (729 kB)  Collecting oauth2==1.5.170  Downloading oauth2-1.5.170.tar.gz (18 kB)  Collecting oauth==1.0.1  Downloading oauth-1.0.1.tar.gz (9.5 kB)  Collecting oauthlib==0.1.2  Downloading oauthlib-0.1.2.tar.gz (24 kB)  Collecting openpyxl==1.5.7  Downloading openpyxl-1.5.7.tar.gz (67 kB)  Collecting ordereddict==1.1  Downloading ordereddict-1.1.tar.gz (2.1 kB)  Collecting pbkdf2==1.3  Downloading pbkdf2-1.3.tar.gz (6.4 kB)  Collecting pdfminer==20110515  Downloading pdfminer-20110515.tar.gz (4.1 MB)  Collecting pexpect==2.4  Downloading pexpect-2.4.tar.gz (113 kB)  Collecting pipe2py==0.9.2  Downloading pipe2py-0.9.2.tar.gz (57 kB)  Collecting pyOpenSSL==0.13  Downloading pyOpenSSL-0.13.tar.gz (250 kB)  Collecting pycrypto==2.5  Downloading pycrypto-2.5.tar.gz (426 kB)  Collecting pycurl==7.19.0  Downloading pycurl-7.19.0.tar.gz (70 kB)  Collecting pyephem==3.7.5.1  Downloading pyephem-3.7.5.1.tar.gz (703 kB)  Collecting pyparsing==1.5.6  Downloading pyparsing-1.5.6.tar.gz (1.4 MB)  Collecting pyth==0.5.6  Downloading pyth-0.5.6.tar.gz (24 kB)  Collecting python-Levenshtein==0.10.2  Downloading python-Levenshtein-0.10.2.tar.gz (45 kB)  Collecting python-dateutil==1.5  Downloading python-dateutil-1.5.tar.gz (233 kB)  Collecting python-gflags==2.0  Downloading python-gflags-2.0.tar.gz (65 kB)  Collecting python-modargs==1.2  Downloading python-modargs-1.2.tar.gz (6.3 kB)  Collecting python-stdnum==0.7  Downloading python-stdnum-0.7.tar.gz (113 kB)  Collecting pytz==2011k  Downloading pytz-2011k.tar.bz2 (166 kB)  Collecting rdflib==3.1.0  Downloading rdflib-3.1.0.tar.gz (249 kB)  Collecting requests-foauth==0.1.1  Downloading requests-foauth-0.1.1.tar.gz (1.9 kB)  Collecting requests==1.0.4  Downloading requests-1.0.4.tar.gz (336 kB)  Collecting selenium==2.5.0  Downloading selenium-2.5.0.tar.gz (2.4 MB)  Collecting simplejson==2.2.1  Downloading simplejson-2.2.1.tar.gz (49 kB)  Collecting suds==0.4  Downloading suds-0.4.tar.gz (104 kB)  Collecting tweepy==1.7.1  Downloading tweepy-1.7.1.tar.gz (19 kB)  Collecting tweetstream==1.1.1  Downloading tweetstream-1.1.1.tar.gz (6.9 kB)  Collecting w3lib==1.0  Downloading w3lib-1.0.tar.gz (6.1 kB)  Collecting xlrd==0.7.1  Downloading xlrd-0.7.1.tar.gz (118 kB)  Collecting xlutils==1.4.1  Downloading xlutils-1.4.1.tar.gz (40 kB)  Collecting xlwt==0.7.2  Downloading xlwt-0.7.2.tar.gz (114 kB)  Collecting xmltodict==0.4  Downloading xmltodict-0.4.tar.gz (3.3 kB)  Collecting zope.interface==3.8.0  Downloading zope.interface-3.8.0.tar.gz (111 kB)  Collecting lxml==2.3.3  Downloading lxml-2.3.3.tar.gz (3.1 MB)  Collecting chromium-compact-language-detector==0.031415  Downloading chromium_compact_language_detector-0.031415.tar.gz (2.2 MB)  Collecting icalendar==3.0.1b1  Downloading icalendar-3.0.1b1.tar.gz (39 kB)  Collecting pyquery==1.0  Downloading pyquery-1.0.tar.gz (17 kB)  Collecting scrapely==0.9  Downloading scrapely-0.9.tar.gz (24 kB)  Collecting Fom==0.9.8  Downloading Fom-0.9.8.tar.gz (70 kB)  Collecting PyYAML==3.10  Downloading PyYAML-3.10.tar.gz (241 kB)  Collecting Scrapy==0.14.1  Downloading Scrapy-0.14.1.tar.gz (719 kB)  Collecting adspygoogle.adwords==15.6.2  Downloading adspygoogle.adwords-15.6.2.tar.gz (166 kB)  Collecting nltk==3.0.2  Downloading nltk-3.0.2.tar.gz (991 kB)  Collecting pydot==1.0.2  Downloading pydot-1.0.2.tar.gz (18 kB)  Collecting M2Crypto==0.22.3  Downloading M2Crypto-0.22.3.tar.gz (74 kB)  Collecting dumptruck>=0.1.2  Downloading dumptruck-0.1.6.tar.gz (15 kB)  Collecting alembic>=0.6.2  Downloading alembic-1.4.2.tar.gz (1.1 MB)  Installing build dependencies: started  Installing build dependencies: finished with status 'done'  Getting requirements to build wheel: started  Getting requirements to build wheel: finished with status 'done'  Preparing wheel metadata: started  Preparing wheel metadata: finished with status 'done'  Collecting python-slugify>=0.0.6  Downloading python-slugify-4.0.1.tar.gz (11 kB)  Collecting distribute  Downloading distribute-0.7.3.zip (145 kB)  Collecting numpy  Downloading numpy-1.16.6-cp27-cp27mu-manylinux1_x86_64.whl (17.0 MB)  Collecting python-editor>=0.3  Downloading python_editor-1.0.4-py2-none-any.whl (4.9 kB)  Collecting Mako  Downloading Mako-1.1.3-py2.py3-none-any.whl (75 kB)  Collecting text-unidecode>=1.3  Downloading text_unidecode-1.3-py2.py3-none-any.whl (78 kB)  Collecting MarkupSafe>=0.9.2  Downloading MarkupSafe-1.1.1-cp27-cp27mu-manylinux1_x86_64.whl (24 kB)  Building wheels for collected packages: BeautifulSoup, Creoleparser, Genshi, Jinja2, Markdown, Pygments, SQLAlchemy, Twisted, Unidecode, anyjson, argparse, beautifulsoup4, bitlyapi, blinker, cartodb, certifi, chardet, ckanclient, colormath, csvkit, dataset, demjson, dropbox, errorhandler, feedparser, fluidinfo.py, gdata, geopy, gevent, google-api-python-client, googlemaps, greenlet, html5lib, httplib2, imposm.parser, jellyfish, mechanize, mock, networkx, ngram, nose, oauth2, oauth, oauthlib, openpyxl, ordereddict, pbkdf2, pdfminer, pexpect, pipe2py, pyOpenSSL, pycrypto, pycurl, pyephem, pyparsing, pyth, python-Levenshtein, python-dateutil, python-gflags, python-modargs, python-stdnum, pytz, rdflib, requests-foauth, requests, selenium, simplejson, suds, tweepy, tweetstream, w3lib, xlrd, xlutils, xlwt, xmltodict, zope.interface, lxml, chromium-compact-language-detector, icalendar, pyquery, scrapely, Fom, PyYAML, Scrapy, adspygoogle.adwords, nltk, pydot, M2Crypto, dumptruck, alembic, python-slugify, distribute  Building wheel for BeautifulSoup (setup.py): started  Building wheel for BeautifulSoup (setup.py): finished with status 'done'  Created wheel for BeautifulSoup: filename=BeautifulSoup-3.2.0-py2-none-any.whl size=31890 sha256=e7d515a9941539fd29f8b56cb3b8710d2ba39fa62cba99942c60016764dd1a91  Stored in directory: /tmp/pip-ephem-wheel-cache-pJJmVa/wheels/07/ef/84/b06e7bf99ec3061d9a1d31ddfae45eee089c0cc6cb7741578b  Building wheel for Creoleparser (setup.py): started  Building wheel for Creoleparser (setup.py): finished with status 'done'  Created wheel for Creoleparser: filename=Creoleparser-0.7.4-py2-none-any.whl size=25837 sha256=c9068b9e03489e0e6853f236f4c0ce3cc20a5a2667f5cc437ac04584c8557c12  Stored in directory: /tmp/pip-ephem-wheel-cache-pJJmVa/wheels/df/a3/94/65ae363824b20787c55936be6c69ad0cfdb9713b4c2859f72a  Building wheel for Genshi (setup.py): started  Building wheel for Genshi (setup.py): finished with status 'done'  Created wheel for Genshi: filename=Genshi-0.6-py2-none-any.whl size=110613 sha256=f84b18265740ca706c2dbab6bc4bb2c2d1eff925d1deca64fa9a152e5d442572  Stored in directory: /tmp/pip-ephem-wheel-cache-pJJmVa/wheels/5a/df/5b/f27840fc4b76eb60cd64043d2caf894b78656f11b3d016a856  Building wheel for Jinja2 (setup.py): started  Building wheel for Jinja2 (setup.py): finished with status 'done'  Created wheel for Jinja2: filename=Jinja2-2.6-py2-none-any.whl size=296732 sha256=69d5ad8ef2b02701c130f4863508a9de032881d899988c6cad8e63e8be0493f0  Stored in directory: /tmp/pip-ephem-wheel-cache-pJJmVa/wheels/02/79/ba/2a51fda3f97bbf2b6fe2d4b6a39cc66fdffe6267fbfd6b9e47  Building wheel for Markdown (setup.py): started  Building wheel for Markdown (setup.py): finished with status 'done'  Created wheel for Markdown: filename=Markdown-2.2.0-py2-none-any.whl size=135270 sha256=e603e7b1ef8ab00437637074481ec0d91fd26b07f8232158f08c520571317d56  Stored in directory: /tmp/pip-ephem-wheel-cache-pJJmVa/wheels/71/d6/5a/3cc9d2ddca0265fe6c6756c843e1f758df9c8757e1c5acfbcf  Building wheel for Pygments (setup.py): started  Building wheel for Pygments (setup.py): finished with status 'done'  Created wheel for Pygments: filename=Pygments-1.4-py2-none-any.whl size=452157 sha256=3ca634309a543468c3508810d1f5ef0ca9fa012d8cfbd987c51041d35954a4cb  Stored in directory: /tmp/pip-ephem-wheel-cache-pJJmVa/wheels/f2/91/89/5fd94f8626f0770fa40062916c9e86070434df930c192820d6  Building wheel for SQLAlchemy (setup.py): started  Building wheel for SQLAlchemy (setup.py): finished with status 'done'  Created wheel for SQLAlchemy: filename=SQLAlchemy-0.6.6-py2-none-any.whl size=584977 sha256=e91ac8962caf3b95d817f8e139fea685987c5d1da46566035ae9573883b01e45  Stored in directory: /tmp/pip-ephem-wheel-cache-pJJmVa/wheels/63/12/05/8f283ba6d09081fc8ca62da679df7d78767c93e9bb19048a61  Building wheel for Twisted (setup.py): started  Building wheel for Twisted (setup.py): finished with status 'done'  Created wheel for Twisted: filename=Twisted-11.1.0-cp27-cp27mu-linux_x86_64.whl size=2716978 sha256=61042bb63442e6f620771dea2eec0e38714059d0ae294deba76c4bddb8e0b3ba  Stored in directory: /tmp/pip-ephem-wheel-cache-pJJmVa/wheels/3c/de/16/f23444230f9439280f7b9b24125c0547b1eeddbe740490b826  Building wheel for Unidecode (setup.py): started  Building wheel for Unidecode (setup.py): finished with status 'done'  Created wheel for Unidecode: filename=Unidecode-0.4.9-py2-none-any.whl size=226426 sha256=8c6be0da6506013ac80ff1de9dff5953ba609f7ae9aa978860abd6c8e7ad0dc9  Stored in directory: /tmp/pip-ephem-wheel-cache-pJJmVa/wheels/ec/ea/2e/a63d73696df0572b0fca54fed83ba25ad62fd77867af43dd5c  Building wheel for anyjson (setup.py): started  Building wheel for anyjson (setup.py): finished with status 'done'  Created wheel for anyjson: filename=anyjson-0.3.3-py2-none-any.whl size=4950 sha256=c25c26353b5fd516bc5a1cb567970b580865b7d1f8370b51c57062ab9bde76ac  Stored in directory: /tmp/pip-ephem-wheel-cache-pJJmVa/wheels/51/e4/7b/e4ca0dd6d60916a0a20d94ad352a671675ed88f83a57830924  Building wheel for argparse (setup.py): started  Building wheel for argparse (setup.py): finished with status 'done'  Created wheel for argparse: filename=argparse-1.2.1-py2-none-any.whl size=21371 sha256=395d96137643bee57ec14e2997b67add21968db99e09c785f37574c703145809  Stored in directory: /tmp/pip-ephem-wheel-cache-pJJmVa/wheels/9f/79/7e/e3f33e05010185975b7ade632c68bad70fcf71d1ff1adc1a02  Building wheel for beautifulsoup4 (setup.py): started  Building wheel for beautifulsoup4 (setup.py): finished with status 'done'  Created wheel for beautifulsoup4: filename=beautifulsoup4-4.1.3-py2-none-any.whl size=66447 sha256=c20ea2b7d2a7955baf1aff52b6236baac7d6299a99eda52f203af0da8053d6f1  Stored in directory: /tmp/pip-ephem-wheel-cache-pJJmVa/wheels/d3/19/bb/b9d3a3ed20aa640d4424e824bf9664ca88da65578a8e0aa7dc  Building wheel for bitlyapi (setup.py): started  Building wheel for bitlyapi (setup.py): finished with status 'done'  Created wheel for bitlyapi: filename=bitlyapi-0.1.1-py2-none-any.whl size=5037 sha256=2920405968ea496d4a157507a9764723a841201f15ab49ba19a6f1febe779dad  Stored in directory: /tmp/pip-ephem-wheel-cache-pJJmVa/wheels/34/46/3e/6aad460bb0a1eb7d676891ebc40da15e73b33141c087e1026b  Building wheel for blinker (setup.py): started  Building wheel for blinker (setup.py): finished with status 'done'  Created wheel for blinker: filename=blinker-1.2-py2-none-any.whl size=12227 sha256=03eba19fd63dec8418202da9fbdf4ac38431d07d2c21c829dfe7e6edfcb7979b  Stored in directory: /tmp/pip-ephem-wheel-cache-pJJmVa/wheels/46/7c/a5/2ad7567f122ba57a8c8ae33614c73bbf7c010e31186e76650d  Building wheel for cartodb (setup.py): started  Building wheel for cartodb (setup.py): finished with status 'done'  Created wheel for cartodb: filename=cartodb-0.6-py2-none-any.whl size=3256 sha256=354211b5e9fa590dbe4b5461a436dd33650c76cd775fd63a7536bfe196945126  Stored in directory: /tmp/pip-ephem-wheel-cache-pJJmVa/wheels/f7/90/f8/0dc1b801160909997b0793f5369b839ad90f3251352286596d  Building wheel for certifi (setup.py): started  Building wheel for certifi (setup.py): finished with status 'done'  Created wheel for certifi: filename=certifi-0.0.8-py2-none-any.whl size=118810 sha256=e100c4a48a1c283e3babb48de0700e04ace972f0e0efefda9f4c36e6b154c3f6  Stored in directory: /tmp/pip-ephem-wheel-cache-pJJmVa/wheels/cb/88/ed/8ba94c14aae542b1df8df509a155a692578e472188be347200  Building wheel for chardet (setup.py): started  Building wheel for chardet (setup.py): finished with status 'done'  Created wheel for chardet: filename=chardet-2.1.1-py2-none-any.whl size=185367 sha256=b4cde51bb99077749319d395b31c524fb0d4b649ef01cba9375fd09c84d4f582  Stored in directory: /tmp/pip-ephem-wheel-cache-pJJmVa/wheels/dd/94/bd/b5716019491e52f8c013d0bad8faa145ca7fd6b8f868cfc4c8  Building wheel for ckanclient (setup.py): started  Building wheel for ckanclient (setup.py): finished with status 'done'  Created wheel for ckanclient: filename=ckanclient-0.10-py2-none-any.whl size=18993 sha256=778b1c558b0ba213b9637f3cf6937b21ddd20bcd88807ff4f63154ef8f4b7cb7  Stored in directory: /tmp/pip-ephem-wheel-cache-pJJmVa/wheels/89/14/73/c06e30796130580674690f1a53cd34ec9c93b52cc767e0398f  Building wheel for colormath (setup.py): started  Building wheel for colormath (setup.py): finished with status 'done'  Created wheel for colormath: filename=colormath-1.0.8-py2-none-any.whl size=24258 sha256=0e0690de5757de8110e51a17c1d45bafca3a4725bebb2461a166ccae5360d374  Stored in directory: /tmp/pip-ephem-wheel-cache-pJJmVa/wheels/7d/8b/0f/fc6d7a6db493f935d030cb77634365af047872e341949d1049  Building wheel for csvkit (setup.py): started  Building wheel for csvkit (setup.py): finished with status 'done'  Created wheel for csvkit: filename=csvkit-0.3.0-py2-none-any.whl size=37190 sha256=028370a7d5606848b84969468b02d13a8b083d91b18d1ed59051f360a447022e  Stored in directory: /tmp/pip-ephem-wheel-cache-pJJmVa/wheels/13/c4/07/12687b2a565ce0275381bb2dd09037107af54351b43531b844  Building wheel for dataset (setup.py): started  Building wheel for dataset (setup.py): finished with status 'done'  Created wheel for dataset: filename=dataset-0.5.2-py2-none-any.whl size=17306 sha256=f3790576d3ca8e5ef749b3670526a581e2c9598b11feb6e301accd11cc1e5332  Stored in directory: /tmp/pip-ephem-wheel-cache-pJJmVa/wheels/14/99/5e/8990bafb90c4f0a4385c31bc5707c1a954ba55c4ac60846487  Building wheel for demjson (setup.py): started  Building wheel for demjson (setup.py): finished with status 'done'  Created wheel for demjson: filename=demjson-1.6-py2-none-any.whl size=37812 sha256=010cd8b70f85f13adc9e9bcdfddeeba41d666149b36a627d54c149b825a1de4c  Stored in directory: /tmp/pip-ephem-wheel-cache-pJJmVa/wheels/7c/6f/cd/217ee3e128235e602d2876e3e651c83cbdf6166ff0463c1a39  Building wheel for dropbox (setup.py): started  Building wheel for dropbox (setup.py): finished with status 'done'  Created wheel for dropbox: filename=dropbox-1.4-py2-none-any.whl size=26758 sha256=80a1e1201eb4cd78d28bb2069458b3e4c2d0ece128cc581db4c0ccacdee92b8b  Stored in directory: /tmp/pip-ephem-wheel-cache-pJJmVa/wheels/e8/08/b6/f207608a88e30f6dfa67a0249b3ffcaa3588fb17b0f5dad140  Building wheel for errorhandler (setup.py): started  Building wheel for errorhandler (setup.py): finished with status 'done'  Created wheel for errorhandler: filename=errorhandler-1.1.1-py2-none-any.whl size=3142 sha256=4d7504d46acb9775b6eeae3bdaa7cc6cc97e5e9d202a86b83523d14cd31083f4  Stored in directory: /tmp/pip-ephem-wheel-cache-pJJmVa/wheels/36/c6/dc/5a3b47ebf87247d9127d7c2ab9a999c39c827434d2d7f775c3  Building wheel for feedparser (setup.py): started  Building wheel for feedparser (setup.py): finished with status 'done'  Created wheel for feedparser: filename=feedparser-5.0.1-py2-none-any.whl size=45836 sha256=4bbc8b207c6eea8a929add8733bf0d457f8ac81f407d064b477eb21c7a6f0214  Stored in directory: /tmp/pip-ephem-wheel-cache-pJJmVa/wheels/c7/bb/41/aceb63fb5e620de5fe4f35b4e16203bb9852553e432e801712  Building wheel for fluidinfo.py (setup.py): started  Building wheel for fluidinfo.py (setup.py): finished with status 'done'  Created wheel for fluidinfo.py: filename=fluidinfo.py-1.1.2-py2-none-any.whl size=5197 sha256=0ba0a0fea5f1d4f01b7f393d72ed9a7e3cadd2e07568450af9959c2b834127a2  Stored in directory: /tmp/pip-ephem-wheel-cache-pJJmVa/wheels/e5/a7/31/689e422883e42a47d76ad7ad8e9d843f0e63961d6a8d0967b6  Building wheel for gdata (setup.py): started  Building wheel for gdata (setup.py): finished with status 'done'  Created wheel for gdata: filename=gdata-2.0.15-py2-none-any.whl size=587590 sha256=62ca91f8f942eafd3dc4502bab5e9815ef121af7e34ebce8df8ad6182cdb72e3  Stored in directory: /tmp/pip-ephem-wheel-cache-pJJmVa/wheels/83/b8/3d/de9f5d5ae954a22d0271f8cb8dd8d054823bdbb1b1a8402502  Building wheel for geopy (setup.py): started  Building wheel for geopy (setup.py): finished with status 'done'  Created wheel for geopy: filename=geopy-0.94.1-py2-none-any.whl size=38341 sha256=771d853ab51881af5a61d528b4bb22722a84ce8a167530a1c2f0cf1dad2f54cb  Stored in directory: /tmp/pip-ephem-wheel-cache-pJJmVa/wheels/de/8d/8c/5473a54bcc4ff93029079355e6bb4797744b6014fcbd34a0d3  Building wheel for gevent (setup.py): started  Building wheel for gevent (setup.py): finished with status 'done'  Created wheel for gevent: filename=gevent-0.13.6-cp27-cp27mu-linux_x86_64.whl size=321701 sha256=4237e883b2a8257ef86317dd2407eadf584724af0f45db0e3a410f2290766fa0  Stored in directory: /tmp/pip-ephem-wheel-cache-pJJmVa/wheels/e1/0c/b4/90f0acf451ccff98a8fc9257027557d2048800e63e6f63ddc8  Building wheel for google-api-python-client (setup.py): started  Building wheel for google-api-python-client (setup.py): finished with status 'done'  Created wheel for google-api-python-client: filename=google_api_python_client-1.0b8-py2-none-any.whl size=69710 sha256=26e42b967e6dab35e39a83d36ccd2977ffc0a8b4c26d3a469c30460f0bceae8d  Stored in directory: /tmp/pip-ephem-wheel-cache-pJJmVa/wheels/f2/b1/5d/21b2963b649573ebcb3ec723995a431b40fbe2ed41940ddf91  Building wheel for googlemaps (setup.py): started  Building wheel for googlemaps (setup.py): finished with status 'done'  Created wheel for googlemaps: filename=googlemaps-1.0.2-py2-none-any.whl size=11032 sha256=1255f0f28be6de45316309e5fcd6179db68681becd15c591fbd7714ac0f7b0f5  Stored in directory: /tmp/pip-ephem-wheel-cache-pJJmVa/wheels/6c/51/e8/b899ea09de08b281330d22f76c9a953c85acd048d7d7194722  Building wheel for greenlet (setup.py): started  Building wheel for greenlet (setup.py): finished with status 'done'  Created wheel for greenlet: filename=greenlet-0.3.2-cp27-cp27mu-linux_x86_64.whl size=36389 sha256=e7a4226f506d023e275612d9925c57f0600a5638bc85492a418472852bd8ca33  Stored in directory: /tmp/pip-ephem-wheel-cache-pJJmVa/wheels/6a/81/5a/98e2b0ae2edb6ec0cbc62da7df0db69099fc4e53647969b43c  Building wheel for html5lib (setup.py): started  Building wheel for html5lib (setup.py): finished with status 'done'  Created wheel for html5lib: filename=html5lib-0.90-py2-none-any.whl size=97309 sha256=9bb0844e656545b8d3dc7bfe49a3088875221eca5d7f93f9324b48041e7c793d  Stored in directory: /tmp/pip-ephem-wheel-cache-pJJmVa/wheels/d7/42/58/c0692be77c1691cef6851e73bb97fb4554fab07617dc5467fc  Building wheel for httplib2 (setup.py): started  Building wheel for httplib2 (setup.py): finished with status 'done'  Created wheel for httplib2: filename=httplib2-0.7.4-py2-none-any.whl size=43628 sha256=e2cfbf5a046846a306dab78701945a4e0b8f9821b5ba376b303abd82e35db2d6  Stored in directory: /tmp/pip-ephem-wheel-cache-pJJmVa/wheels/e3/f5/54/5139fd4fba131aa6e6ac77671d949ebd179a059429e617eaae  Building wheel for imposm.parser (setup.py): started  Building wheel for imposm.parser (setup.py): finished with status 'done'  Created wheel for imposm.parser: filename=imposm.parser-1.0.3-cp27-cp27mu-linux_x86_64.whl size=503637 sha256=89ad62090e514fd781e68ab3c69729d612c66e8ce8e600af1ecebc3bd38d1001  Stored in directory: /tmp/pip-ephem-wheel-cache-pJJmVa/wheels/b4/6e/27/aa7850e9a25af8c2aec83abbe881d70bd2fe898b9d888eca03  Building wheel for jellyfish (setup.py): started  Building wheel for jellyfish (setup.py): finished with status 'done'  Created wheel for jellyfish: filename=jellyfish-0.2.0-cp27-cp27mu-linux_x86_64.whl size=47731 sha256=528c2ffa464a6d4c2c0cc8db3305786a2b53cd25a26787aa2b875586e21be942  Stored in directory: /tmp/pip-ephem-wheel-cache-pJJmVa/wheels/c7/f2/6b/0b8c8dfbec13c4e001dc606097a4f33b5486a6d8d707008658  Building wheel for mechanize (setup.py): started  Building wheel for mechanize (setup.py): finished with status 'done'  Created wheel for mechanize: filename=mechanize-0.2.5-py2-none-any.whl size=150110 sha256=9086b73164c8a97e29429df0161c2583a62474e4ef855c9e3a3e6bfb5f099ebc  Stored in directory: /tmp/pip-ephem-wheel-cache-pJJmVa/wheels/fe/20/00/f8e9ca5a8b8c75eec22f5d63730b66e95be06274f04e9babf6  Building wheel for mock (setup.py): started  Building wheel for mock (setup.py): finished with status 'done'  Created wheel for mock: filename=mock-0.7.2-py2-none-any.whl size=12370 sha256=722554e73161ed4f37de284a6d62a8b7fa826c9df9325b44c884f8e0961a7841  Stored in directory: /tmp/pip-ephem-wheel-cache-pJJmVa/wheels/d6/aa/b5/04b53d9076fdd47ed004705ada84d627657f730f58fad44ebc  Building wheel for networkx (setup.py): started  Building wheel for networkx (setup.py): finished with status 'done'  Created wheel for networkx: filename=networkx-1.6-py2-none-any.whl size=850880 sha256=e3df0068b7487ea2fac187e9fe1e341d3b879e507447d6457dcd4d8510da65f5  Stored in directory: /tmp/pip-ephem-wheel-cache-pJJmVa/wheels/5b/aa/e9/d42bee2d032fa1655873db37bf9867f61af349f012377696b6  Building wheel for ngram (setup.py): started  Building wheel for ngram (setup.py): finished with status 'done'  Created wheel for ngram: filename=ngram-3.3.0-py2-none-any.whl size=9153 sha256=bef8ddcd27c97b819f52a238a523b5abba013e6a7e2a125f37bfa11d34922c25  Stored in directory: /tmp/pip-ephem-wheel-cache-pJJmVa/wheels/87/31/d9/3c621a2f43598cb3c89c63e6c33682486b01b3a60f9208691a  Building wheel for nose (setup.py): started  Building wheel for nose (setup.py): finished with status 'done'  Created wheel for nose: filename=nose-1.1.2-py2-none-any.whl size=148605 sha256=86787dbfbe3024bb7c53a73f5945cdf913c5c814f2d275003a9c887ec17850d2  Stored in directory: /tmp/pip-ephem-wheel-cache-pJJmVa/wheels/06/37/e3/ddb71449597fb06b3901d98b72ced89276ebe8f98024ad92ab  Building wheel for oauth2 (setup.py): started  Building wheel for oauth2 (setup.py): finished with status 'done'  Created wheel for oauth2: filename=oauth2-1.5.170-py2-none-any.whl size=22113 sha256=4142f7b732971108fc069d13dc6e52f2f49cafd00e500089115c407e250fc4e4  Stored in directory: /tmp/pip-ephem-wheel-cache-pJJmVa/wheels/24/3e/18/0a7e3e7996b5202e05785f21d2404d4d95a61e7e4e51029c1a  Building wheel for oauth (setup.py): started  Building wheel for oauth (setup.py): finished with status 'done'  Created wheel for oauth: filename=oauth-1.0.1-py2-none-any.whl size=8002 sha256=f97c978721a4db9a48a8be9eb4b7b26dd07c24ea19d5bdc85fe1e8901084ea1b  Stored in directory: /tmp/pip-ephem-wheel-cache-pJJmVa/wheels/91/5a/d5/fe83086fec03ce5d8f06b3ad7da7d0e43ae01a293897b81f33  Building wheel for oauthlib (setup.py): started  Building wheel for oauthlib (setup.py): finished with status 'done'  Created wheel for oauthlib: filename=oauthlib-0.1.2-py2-none-any.whl size=23049 sha256=954040c3c86dbf9282f7236eb876d358aeeb98bc5281fec2803805876e3a6b8d  Stored in directory: /tmp/pip-ephem-wheel-cache-pJJmVa/wheels/b8/13/d5/3abc0e8e44f00aa8a5dd4d05623f614750db62fe79fe9abb8c  Building wheel for openpyxl (setup.py): started  Building wheel for openpyxl (setup.py): finished with status 'done'  Created wheel for openpyxl: filename=openpyxl-1.5.7-py2-none-any.whl size=118734 sha256=d60aa3c3be6b59dd1d70af56b1c0e8b081b3506b949bd334089d39283d44780d  Stored in directory: /tmp/pip-ephem-wheel-cache-pJJmVa/wheels/52/98/c9/b4b68149662a93a123b8edbee69a4f44656744eae13ce48f7f  Building wheel for ordereddict (setup.py): started  Building wheel for ordereddict (setup.py): finished with status 'done'  Created wheel for ordereddict: filename=ordereddict-1.1-py2-none-any.whl size=3553 sha256=9cd81c84d8be22118794eb2b6df9d068ee1fe25321cbfb8eb1cc38f05e431a10  Stored in directory: /tmp/pip-ephem-wheel-cache-pJJmVa/wheels/a8/85/32/94bf1c20374a7e7bc84e9823b87ca795f0e45213f9ee22e1ee  Building wheel for pbkdf2 (setup.py): started  Building wheel for pbkdf2 (setup.py): finished with status 'done'  Created wheel for pbkdf2: filename=pbkdf2-1.3-py2-none-any.whl size=5105 sha256=cc905c1c487f568cb5e7b8bb7cf36ab919ad99ad412e854d22f346435f3b6862  Stored in directory: /tmp/pip-ephem-wheel-cache-pJJmVa/wheels/8e/4d/9e/2319091bc90a29463fef88a342ba923ba6931594a651ec84c3  Building wheel for pdfminer (setup.py): started  Building wheel for pdfminer (setup.py): finished with status 'done'  Created wheel for pdfminer: filename=pdfminer-20110515-py2-none-any.whl size=102332 sha256=11cc88439da743fd27f29b597a2a5b38f5c273918cc3ffcd330bf4ac127c610d  Stored in directory: /tmp/pip-ephem-wheel-cache-pJJmVa/wheels/e4/f5/08/5cfd542211092b226c6c8f3d04f55118919f287fd346e99cf0  Building wheel for pexpect (setup.py): started  Building wheel for pexpect (setup.py): finished with status 'done'  Created wheel for pexpect: filename=pexpect-2.4-py2-none-any.whl size=38404 sha256=9a96093563fe237fa4feb8f7d021b648f52f9c18a9cf7615be28a105e751fb77  Stored in directory: /tmp/pip-ephem-wheel-cache-pJJmVa/wheels/c8/8d/8f/ebd4192af0036586806c85b2ccd1f7547872b682cb293d3205  Building wheel for pipe2py (setup.py): started  Building wheel for pipe2py (setup.py): finished with status 'done'  Created wheel for pipe2py: filename=pipe2py-0.9.2-py2-none-any.whl size=70285 sha256=ea36a3062674a9e623ea42c29aa74b0a721ee521f7a281d4a2b02d336c7815ba  Stored in directory: /tmp/pip-ephem-wheel-cache-pJJmVa/wheels/7c/ef/08/20cb698b0ed59e15ab664e976e73cd7039e462aeac9d5c962e  Building wheel for pyOpenSSL (setup.py): started  Building wheel for pyOpenSSL (setup.py): finished with status 'done'  Created wheel for pyOpenSSL: filename=pyOpenSSL-0.13-cp27-cp27mu-linux_x86_64.whl size=293378 sha256=e3c2353fb5a328430a9e53173d9e3ae8a94fdd9e463a22a4c91b73515c95eec1  Stored in directory: /tmp/pip-ephem-wheel-cache-pJJmVa/wheels/bb/19/ca/ded396f6fe2b146e971146ec72757bb38cc4e384638c6034a2  Building wheel for pycrypto (setup.py): started  Building wheel for pycrypto (setup.py): finished with status 'done'  Created wheel for pycrypto: filename=pycrypto-2.5-cp27-cp27mu-linux_x86_64.whl size=455418 sha256=6bce9c964680b3fcca728acf8c505822ad34760c263f9e16db293dfdab7b542e  Stored in directory: /tmp/pip-ephem-wheel-cache-pJJmVa/wheels/f6/de/f7/227b56555f5872839afc369165b9029e5f9dbc1a795150da99  Building wheel for pycurl (setup.py): started  Building wheel for pycurl (setup.py): finished with status 'done'  Created wheel for pycurl: filename=pycurl-7.19.0-cp27-cp27mu-linux_x86_64.whl size=173726 sha256=ecac9a80e79532b71bba25291319b9255c8cbb9d82c24143d917c023a243d1e5  Stored in directory: /tmp/pip-ephem-wheel-cache-pJJmVa/wheels/e9/63/aa/3f173157dc19987b37fb1cd21c7b8f0c954c8d766757ba8774  Building wheel for pyephem (setup.py): started  Building wheel for pyephem (setup.py): finished with status 'done'  Created wheel for pyephem: filename=pyephem-3.7.5.1-cp27-cp27mu-linux_x86_64.whl size=1048362 sha256=7314fca52f4ae9f4d1077546e255ca589bb39592fbd50045a96724943685aa50  Stored in directory: /tmp/pip-ephem-wheel-cache-pJJmVa/wheels/a2/52/a4/b09bb1432224596e67c58610d759ff63073cb94ffcc8ccd998  Building wheel for pyparsing (setup.py): started  Building wheel for pyparsing (setup.py): finished with status 'error'  ERROR: Command errored out with exit status 1:  command: /app/.heroku/python/bin/python -u -c 'import sys, setuptools, tokenize; sys.argv[0] = '"'"'/tmp/pip-install-IP4Sn0/pyparsing/setup.py'"'"'; __file__='"'"'/tmp/pip-install-IP4Sn0/pyparsing/setup.py'"'"';f=getattr(tokenize, '"'"'open'"'"', open)(__file__);code=f.read().replace('"'"'\r\n'"'"', '"'"'\n'"'"');f.close();exec(compile(code, __file__, '"'"'exec'"'"'))' bdist_wheel -d /tmp/pip-wheel-rUsF84  cwd: /tmp/pip-install-IP4Sn0/pyparsing/  Complete output (21 lines):  Traceback (most recent call last):  File "<string>", line 1, in <module>  File "/tmp/pip-install-IP4Sn0/pyparsing/setup.py", line 54, in <module>  'Programming Language :: Python :: 3',  File "/app/.heroku/python/lib/python2.7/distutils/core.py", line 137, in setup  ok = dist.parse_command_line()  File "/app/.heroku/python/lib/python2.7/site-packages/setuptools/dist.py", line 707, in parse_command_line  result = _Distribution.parse_command_line(self)  File "/app/.heroku/python/lib/python2.7/distutils/dist.py", line 467, in parse_command_line  args = self._parse_command_opts(parser, args)  File "/app/.heroku/python/lib/python2.7/site-packages/setuptools/dist.py", line 1014, in _parse_command_opts  nargs = _Distribution._parse_command_opts(self, parser, args)  File "/app/.heroku/python/lib/python2.7/distutils/dist.py", line 523, in _parse_command_opts  cmd_class = self.get_command_class(command)  File "/app/.heroku/python/lib/python2.7/site-packages/setuptools/dist.py", line 833, in get_command_class  ep.require(installer=self.fetch_build_egg)  File "/app/.heroku/python/lib/python2.7/site-packages/pkg_resources/__init__.py", line 2465, in require  items = working_set.resolve(reqs, env, installer, extras=self.extras)  File "/app/.heroku/python/lib/python2.7/site-packages/pkg_resources/__init__.py", line 791, in resolve  raise VersionConflict(dist, req).with_context(dependent_req)  pkg_resources.ContextualVersionConflict: (pyparsing 1.5.6 (/tmp/build/.heroku/python/lib/python2.7/site-packages), Requirement.parse('pyparsing>=2.0.2'), set(['packaging'])) ----------------------------------------  ERROR: Failed building wheel for pyparsing  Running setup.py clean for pyparsing  Building wheel for pyth (setup.py): started  Building wheel for pyth (setup.py): finished with status 'done'  Created wheel for pyth: filename=pyth-0.5.6-py2-none-any.whl size=26227 sha256=49a7535ad3bf386e8145c784f3cd1f1983ae433bb4f40f12be30b7c9b1cb77eb  Stored in directory: /tmp/pip-ephem-wheel-cache-pJJmVa/wheels/b4/a9/9e/78c258e335f4f1cac5c6f09c1c27980f387b5ec365f90677a9  Building wheel for python-Levenshtein (setup.py): started  Building wheel for python-Levenshtein (setup.py): finished with status 'done'  Created wheel for python-Levenshtein: filename=python_Levenshtein-0.10.2-cp27-cp27mu-linux_x86_64.whl size=115857 sha256=cda438af1bb6574f7d86b2d322c660b9b348580133620d971e4995c150f06e37  Stored in directory: /tmp/pip-ephem-wheel-cache-pJJmVa/wheels/58/9e/d7/030be6b0029af61a8a71e18f288bdb83d188c5ddcd48cf4df9  Building wheel for python-dateutil (setup.py): started  Building wheel for python-dateutil (setup.py): finished with status 'done'  Created wheel for python-dateutil: filename=python_dateutil-1.5-py2-none-any.whl size=202992 sha256=2083b86a72c682cdf76f6304c4f831add6c10e581a18fd126d892cf97a4e7efd  Stored in directory: /tmp/pip-ephem-wheel-cache-pJJmVa/wheels/4a/60/2d/8b0a3630a98204ad1a2d5a378c9ff08564645ee63761dbd110  Building wheel for python-gflags (setup.py): started  Building wheel for python-gflags (setup.py): finished with status 'done'  Created wheel for python-gflags: filename=python_gflags-2.0-py2-none-any.whl size=40660 sha256=d4553e05e414c3508fdf129f95f33c84e862901784ae42be5ba65cab50dbf5ea  Stored in directory: /tmp/pip-ephem-wheel-cache-pJJmVa/wheels/77/5c/29/573608ea850d45a2efbc05f0a9a8fa7a528e60678ebb48f301  Building wheel for python-modargs (setup.py): started  Building wheel for python-modargs (setup.py): finished with status 'done'  Created wheel for python-modargs: filename=python_modargs-1.2-py2-none-any.whl size=6824 sha256=023dcb28454fae849bdf5bf5637f5c027e8c4263130b4ffeea87129bb35bd468  Stored in directory: /tmp/pip-ephem-wheel-cache-pJJmVa/wheels/bc/0c/b4/e330ddd96b44b0fa50ccd8c60221a2fc7fcf9def11fe894599  Building wheel for python-stdnum (setup.py): started  Building wheel for python-stdnum (setup.py): finished with status 'done'  Created wheel for python-stdnum: filename=python_stdnum-0.7-py2-none-any.whl size=157968 sha256=802cc3aa002c52fa8e61bac00240369cce1d5b2dee155118a6c65137909c5697  Stored in directory: /tmp/pip-ephem-wheel-cache-pJJmVa/wheels/11/7d/8c/5cf6ad3982fd81b2a8ebab280f8effd8360b95a65b619aa2fc  Building wheel for pytz (setup.py): started  Building wheel for pytz (setup.py): finished with status 'done'  Created wheel for pytz: filename=pytz-2011k-py2-none-any.whl size=500674 sha256=75ff6d10a21cfd34ec6c82a78f3f3fbe0c23ee6b12ae368ef79d087d578ae0c2  Stored in directory: /tmp/pip-ephem-wheel-cache-pJJmVa/wheels/5a/83/af/39aeb873c9bee24feb3782fe6ebdd0f73886102c8241580fd2  Building wheel for rdflib (setup.py): started  Building wheel for rdflib (setup.py): finished with status 'done'  Created wheel for rdflib: filename=rdflib-3.1.0-py2-none-any.whl size=111076 sha256=eed4f0f33d7239618f1045c1f0035502fcfa57a1cc258e63ce2ca3a19abda549  Stored in directory: /tmp/pip-ephem-wheel-cache-pJJmVa/wheels/11/90/04/4fe39550b82ea2d5b00fba6fe2ee1d77ea0ffcdaf2532d6027  Building wheel for requests-foauth (setup.py): started  Building wheel for requests-foauth (setup.py): finished with status 'done'  Created wheel for requests-foauth: filename=requests_foauth-0.1.1-py2-none-any.whl size=2459 sha256=014c137a5fe7140ff9ceae1cd4d1a03ed364245765ab7e7e654bee6fef8064c3  Stored in directory: /tmp/pip-ephem-wheel-cache-pJJmVa/wheels/84/f7/b9/4bdecca7298edd3ac9126061b8010f9b8ed85a30df3b1b1748  Building wheel for requests (setup.py): started  Building wheel for requests (setup.py): finished with status 'done'  Created wheel for requests: filename=requests-1.0.4-py2-none-any.whl size=361328 sha256=5c83316b8d66435a21afa7cdeab325269a55f0e9b10cd514de0ed3ecc7479806  Stored in directory: /tmp/pip-ephem-wheel-cache-pJJmVa/wheels/ad/80/ae/0057447a08dd9fb3970f6c95ca2f27c4ee95fbcffdccff4adf  Building wheel for selenium (setup.py): started  Building wheel for selenium (setup.py): finished with status 'done'  Created wheel for selenium: filename=selenium-2.5.0-py2-none-any.whl size=2394013 sha256=b03fa29f6418ef90707d083634904f1eda21994eea3df2e1081d4d58e278d56d  Stored in directory: /tmp/pip-ephem-wheel-cache-pJJmVa/wheels/d9/ce/e1/e5c82456e43220107c7bab236ab538803d32bf86fa30134e57  Building wheel for simplejson (setup.py): started  Building wheel for simplejson (setup.py): finished with status 'done'  Created wheel for simplejson: filename=simplejson-2.2.1-cp27-cp27mu-linux_x86_64.whl size=93695 sha256=9d7b22a42260601f6b7688c226f313043e8b5f3de3dea157a72e2c61588c4375  Stored in directory: /tmp/pip-ephem-wheel-cache-pJJmVa/wheels/cf/07/0d/742b0a8e202aa3d8a3b713338d87d22dd11b539782e4044f70  Building wheel for suds (setup.py): started  Building wheel for suds (setup.py): finished with status 'done'  Created wheel for suds: filename=suds-0.4-py2-none-any.whl size=292074 sha256=043e1ecd89699001b6812d7bc04dc686eea81615ffa4ee915c204c74e9baf978  Stored in directory: /tmp/pip-ephem-wheel-cache-pJJmVa/wheels/16/1f/2b/ac835cbf5c6be07acaa55267c5cf3f1a709ff0a698ed62a6a4  Building wheel for tweepy (setup.py): started  Building wheel for tweepy (setup.py): finished with status 'done'  Created wheel for tweepy: filename=tweepy-1.7.1-py2-none-any.whl size=23984 sha256=35ca4c6b615923b716189721606c3d2fdf37b3a96028a56e2b93746f4d306553  Stored in directory: /tmp/pip-ephem-wheel-cache-pJJmVa/wheels/7e/1a/d9/698033a44a4f550438a29e81ecef09815660c0ea3a0ff352ec  Building wheel for tweetstream (setup.py): started  Building wheel for tweetstream (setup.py): finished with status 'done'  Created wheel for tweetstream: filename=tweetstream-1.1.1-py2-none-any.whl size=7478 sha256=f5f5f978ea996e2604fc93877dff52ce0cbd2e6a4f7616ed6a12064aac8cf1fd  Stored in directory: /tmp/pip-ephem-wheel-cache-pJJmVa/wheels/08/6b/4a/8d989ec37a96c84f15ea90498d4dab5ec665d997e6afeec881  Building wheel for w3lib (setup.py): started  Building wheel for w3lib (setup.py): finished with status 'done'  Created wheel for w3lib: filename=w3lib-1.0-py2-none-any.whl size=7758 sha256=8184273d1397b352dd2315873fdb3b56d6acdb6ceed647fad537cc86281a74bd  Stored in directory: /tmp/pip-ephem-wheel-cache-pJJmVa/wheels/cc/c4/1f/faeb25ebfc5f9281145da5553c51238650a60d4e2069141236  Building wheel for xlrd (setup.py): started  Building wheel for xlrd (setup.py): finished with status 'done'  Created wheel for xlrd: filename=xlrd-0.7.1-py2-none-any.whl size=117428 sha256=d0e5dc8bf3e9e191219dc7f6a09479f76edc043f1195b749468ce6c5dc7fe8f7  Stored in directory: /tmp/pip-ephem-wheel-cache-pJJmVa/wheels/a7/f8/df/b6e533faf23cc22a9c5811565944f14f46f87829258ce1b355  Building wheel for xlutils (setup.py): started  Building wheel for xlutils (setup.py): finished with status 'done'  Created wheel for xlutils: filename=xlutils-1.4.1-py2-none-any.whl size=47141 sha256=a5aef3b26c1effccb3617b1a83b370bb115b01bfcf95dcf512c0f74fdb7af1db  Stored in directory: /tmp/pip-ephem-wheel-cache-pJJmVa/wheels/a2/16/a5/2053c6f9196f1f144d8b2346ddd543ce3b51d193aac94fc4e0  Building wheel for xlwt (setup.py): started  Building wheel for xlwt (setup.py): finished with status 'done'  Created wheel for xlwt: filename=xlwt-0.7.2-py2-none-any.whl size=119388 sha256=0340d92b8be1536f6d927bfd8889122f94a6b6cef380613391b46fe6aa492ff6  Stored in directory: /tmp/pip-ephem-wheel-cache-pJJmVa/wheels/ba/4b/ed/c007cb9afddda572690332d045c6c66d0db3bf4aa1ae6c7b24  Building wheel for xmltodict (setup.py): started  Building wheel for xmltodict (setup.py): finished with status 'done'  Created wheel for xmltodict: filename=xmltodict-0.4-py2-none-any.whl size=3945 sha256=efbe4bb7eaa4d62e773b3a0ebb9b890e1d8d54ef9a43c332ea9b97653bd71fb0  Stored in directory: /tmp/pip-ephem-wheel-cache-pJJmVa/wheels/4f/ea/36/0d4cecd31fc548f85b761a156cd4f84253024b87bff587421b  Building wheel for zope.interface (setup.py): started  Building wheel for zope.interface (setup.py): finished with status 'done'  Created wheel for zope.interface: filename=zope.interface-3.8.0-cp27-cp27mu-linux_x86_64.whl size=170349 sha256=3d78013cc2f05b17b5ed1df2d9858336b59e5e84ee1279b5df13493780e417e6  Stored in directory: /tmp/pip-ephem-wheel-cache-pJJmVa/wheels/c1/85/27/b22bba0aebb79f21e787517e4d5aa795f5451396e33549bf13  Building wheel for lxml (setup.py): started  Building wheel for lxml (setup.py): finished with status 'done'  Created wheel for lxml: filename=lxml-2.3.3-cp27-cp27mu-linux_x86_64.whl size=2164280 sha256=3e31a0e68d8e864a9a31add8996f6806496dac6d8c32071293bdfdf10ed63e33  Stored in directory: /tmp/pip-ephem-wheel-cache-pJJmVa/wheels/03/52/93/c8b3b7b1337aab5a449bf53c8efecfc57755c391e5d20e5dd8  Building wheel for chromium-compact-language-detector (setup.py): started  Building wheel for chromium-compact-language-detector (setup.py): finished with status 'done'  Created wheel for chromium-compact-language-detector: filename=chromium_compact_language_detector-0.31415-cp27-cp27mu-linux_x86_64.whl size=926028 sha256=2f306b21775ee18fabbf96349997b7a1de521533eb358245d92178d856416b3a  Stored in directory: /tmp/pip-ephem-wheel-cache-pJJmVa/wheels/95/f0/68/b059de6f709a514a0857908570e92b907a62ce12b3d97fa741  Building wheel for icalendar (setup.py): started  Building wheel for icalendar (setup.py): finished with status 'done'  Created wheel for icalendar: filename=icalendar-3.0.1b1-py2-none-any.whl size=44235 sha256=8692097cd6744701ff45127ba33bef9ff907e2d650c7b866a694d70352cd9561  Stored in directory: /tmp/pip-ephem-wheel-cache-pJJmVa/wheels/68/07/f9/c72b3ea9763c9941dc30b9476380a6b60bbb378dc11d2defbf  Building wheel for pyquery (setup.py): started  Building wheel for pyquery (setup.py): finished with status 'done'  Created wheel for pyquery: filename=pyquery-1.0-py2-none-any.whl size=18752 sha256=9137943919c42861904bd1c3aebc8abc4587390ecdebcbffa9d403c9201ce895  Stored in directory: /tmp/pip-ephem-wheel-cache-pJJmVa/wheels/38/71/e6/01761f0286642c2a5d80bae38f875fd4243956e70a80bde145  Building wheel for scrapely (setup.py): started  Building wheel for scrapely (setup.py): finished with status 'done'  Created wheel for scrapely: filename=scrapely-0.9-py2-none-any.whl size=28876 sha256=13621ce5b11115640891ef71760404bb3238d31328cbf8cee88444674582bfaa  Stored in directory: /tmp/pip-ephem-wheel-cache-pJJmVa/wheels/17/18/88/3949902b7a37a972aea5a629d95902e4c2ebfebcb9a6b5cb78  Building wheel for Fom (setup.py): started  Building wheel for Fom (setup.py): finished with status 'done'  Created wheel for Fom: filename=Fom-0.9.8-py2-none-any.whl size=18280 sha256=45e281fc489eaaadc94bed171c4ea1e02f13f68bcd94cfe0a72c970310cfd9ed  Stored in directory: /tmp/pip-ephem-wheel-cache-pJJmVa/wheels/14/df/a1/0d297fdc97f1fe1ef3c39a8ad4c327afa0836ad56ddbf5f538  Building wheel for PyYAML (setup.py): started  Building wheel for PyYAML (setup.py): finished with status 'done'  Created wheel for PyYAML: filename=PyYAML-3.10-cp27-cp27mu-linux_x86_64.whl size=43803 sha256=0780514eff6533de197b9930f91eafecc92d875af8282dbcd3fb3574a64c7c2d  Stored in directory: /tmp/pip-ephem-wheel-cache-pJJmVa/wheels/d4/78/72/d816fb40f9f64ad3027e2a3c104c95fd89802f8e6aa7f804c7  Building wheel for Scrapy (setup.py): started  Building wheel for Scrapy (setup.py): finished with status 'done'  Created wheel for Scrapy: filename=Scrapy-0.14.1-py2-none-any.whl size=403666 sha256=549c4d4533f130764373f0a0f9738beb83e0b9f9d976a31ca7ffcfb7484bdf49  Stored in directory: /tmp/pip-ephem-wheel-cache-pJJmVa/wheels/d7/9e/31/d548f1fd82752da924ed3e94ff73f45a55213c3cda4b1fb0fe  Building wheel for adspygoogle.adwords (setup.py): started  Building wheel for adspygoogle.adwords (setup.py): finished with status 'done'  Created wheel for adspygoogle.adwords: filename=adspygoogle.adwords-15.6.2-py2-none-any.whl size=199409 sha256=d929b29666b7859d7f14e87ffc1634a9858a922da9a8e799c8258b77696f806a  Stored in directory: /tmp/pip-ephem-wheel-cache-pJJmVa/wheels/e7/b9/54/55e425f8dd40f21a910b00e66cd69ee888a3d920348b7abe81  Building wheel for nltk (setup.py): started  Building wheel for nltk (setup.py): finished with status 'done'  Created wheel for nltk: filename=nltk-3.0.2-py2-none-any.whl size=1153627 sha256=1a0f4e6950d6576dc24b9517ef00b1a3d2aba27d249b0bb4dff16de530c7d87c  Stored in directory: /tmp/pip-ephem-wheel-cache-pJJmVa/wheels/1d/cb/ea/49002cba5e750f3960891df6a207aca03aa4db20b8be193c91  Building wheel for pydot (setup.py): started  Building wheel for pydot (setup.py): finished with status 'done'  Created wheel for pydot: filename=pydot-1.0.2-py2-none-any.whl size=20341 sha256=3a0a63aa901188b1444996bfdb5b571529fc8cb2ff2a1a14429d51fa9a03ff82  Stored in directory: /tmp/pip-ephem-wheel-cache-pJJmVa/wheels/13/dd/c8/a0f7af3ae624535282b967399fec610685f62211e0d644766d  Building wheel for M2Crypto (setup.py): started  Building wheel for M2Crypto (setup.py): finished with status 'done'  Created wheel for M2Crypto: filename=M2Crypto-0.22.3-cp27-cp27mu-linux_x86_64.whl size=606506 sha256=0588bf87002fecfe0e14973da7c8ec51bb37e4741c884a8275fd1c3bd72fb411  Stored in directory: /tmp/pip-ephem-wheel-cache-pJJmVa/wheels/91/c8/56/4becabfa93641a90a05b17b54f5276665cb6c693d350899cc2  Building wheel for dumptruck (setup.py): started  Building wheel for dumptruck (setup.py): finished with status 'done'  Created wheel for dumptruck: filename=dumptruck-0.1.6-py2-none-any.whl size=11844 sha256=f081b5f027aa9a3b90fb64013c8a0d7a6a36c2a269a60f3c57e1bd64649ebfc9  Stored in directory: /tmp/pip-ephem-wheel-cache-pJJmVa/wheels/dc/75/e9/1e61c4080c73e7bda99614549591f83b53bcc2d682f26fce62  Building wheel for alembic (PEP 517): started  Building wheel for alembic (PEP 517): finished with status 'done'  Created wheel for alembic: filename=alembic-1.4.2-py2.py3-none-any.whl size=159544 sha256=575b5ad99024c210be473394941da45f2678c1c98d5782715e36a76e393f5303  Stored in directory: /tmp/pip-ephem-wheel-cache-pJJmVa/wheels/c2/d0/1a/1a4a7d07f2fbbc44ebc5d37de0c5d948cdbfa529d4e50dbc72  Building wheel for python-slugify (setup.py): started  Building wheel for python-slugify (setup.py): finished with status 'done'  Created wheel for python-slugify: filename=python_slugify-4.0.1-py2.py3-none-any.whl size=6768 sha256=370ef1da9818dc4fac17b03d0d9523736e58951c1dc569faf6cd139bbdbd8c08  Stored in directory: /tmp/pip-ephem-wheel-cache-pJJmVa/wheels/21/cb/1e/2c64b839b308d8ef9852b3867ff7acc9078da863127714f812  Building wheel for distribute (setup.py): started  Building wheel for distribute (setup.py): finished with status 'error'  ERROR: Command errored out with exit status 1:  command: /app/.heroku/python/bin/python -u -c 'import sys, setuptools, tokenize; sys.argv[0] = '"'"'/tmp/pip-install-IP4Sn0/distribute/setup.py'"'"'; __file__='"'"'/tmp/pip-install-IP4Sn0/distribute/setup.py'"'"';f=getattr(tokenize, '"'"'open'"'"', open)(__file__);code=f.read().replace('"'"'\r\n'"'"', '"'"'\n'"'"');f.close();exec(compile(code, __file__, '"'"'exec'"'"'))' bdist_wheel -d /tmp/pip-wheel-mYIrOI  cwd: /tmp/pip-install-IP4Sn0/distribute/  Complete output (25 lines):  Traceback (most recent call last):  File "<string>", line 1, in <module>  File "/tmp/pip-install-IP4Sn0/distribute/setup.py", line 58, in <module>  setuptools.setup(**setup_params)  File "/app/.heroku/python/lib/python2.7/distutils/core.py", line 137, in setup  ok = dist.parse_command_line()  File "setuptools/dist.py", line 276, in parse_command_line  result = _Distribution.parse_command_line(self)  File "/app/.heroku/python/lib/python2.7/distutils/dist.py", line 467, in parse_command_line  args = self._parse_command_opts(parser, args)  File "setuptools/dist.py", line 602, in _parse_command_opts  nargs = _Distribution._parse_command_opts(self, parser, args)  File "/app/.heroku/python/lib/python2.7/distutils/dist.py", line 523, in _parse_command_opts  cmd_class = self.get_command_class(command)  File "setuptools/dist.py", line 406, in get_command_class  ep.require(installer=self.fetch_build_egg)  File "pkg_resources.py", line 2254, in require  working_set.resolve(self.dist.requires(self.extras),env,installer)))  File "pkg_resources.py", line 2471, in requires  dm = self._dep_map  File "pkg_resources.py", line 2682, in _dep_map  self.__dep_map = self._compute_dependencies()  File "pkg_resources.py", line 2699, in _compute_dependencies  from _markerlib import compile as compile_marker  ImportError: No module named _markerlib ----------------------------------------  ERROR: Failed building wheel for distribute  Running setup.py clean for distribute  Successfully built BeautifulSoup Creoleparser Genshi Jinja2 Markdown Pygments SQLAlchemy Twisted Unidecode anyjson argparse beautifulsoup4 bitlyapi blinker cartodb certifi chardet ckanclient colormath csvkit dataset demjson dropbox errorhandler feedparser fluidinfo.py gdata geopy gevent google-api-python-client googlemaps greenlet html5lib httplib2 imposm.parser jellyfish mechanize mock networkx ngram nose oauth2 oauth oauthlib openpyxl ordereddict pbkdf2 pdfminer pexpect pipe2py pyOpenSSL pycrypto pycurl pyephem pyth python-Levenshtein python-dateutil python-gflags python-modargs python-stdnum pytz rdflib requests-foauth requests selenium simplejson suds tweepy tweetstream w3lib xlrd xlutils xlwt xmltodict zope.interface lxml chromium-compact-language-detector icalendar pyquery scrapely Fom PyYAML Scrapy adspygoogle.adwords nltk pydot M2Crypto dumptruck alembic python-slugify  Failed to build pyparsing distribute  DEPRECATION: Could not build wheels for pyparsing, distribute which do not use PEP 517. pip will fall back to legacy 'setup.py install' for these. pip 21.0 will remove support for this functionality. A possible replacement is to fix the wheel build issue reported above. You can find discussion regarding this at https://github.com/pypa/pip/issues/8368.  Installing collected packages: dumptruck, requests, scraperwiki, BeautifulSoup, Genshi, Creoleparser, Jinja2, Markdown, Pygments, SQLAlchemy, zope.interface, Twisted, Unidecode, anyjson, argparse, beautifulsoup4, bitlyapi, blinker, httplib2, oauth2, cartodb, certifi, chardet, ckanclient, colormath, xlrd, python-dateutil, csvkit, python-editor, MarkupSafe, Mako, alembic, text-unidecode, python-slugify, PyYAML, dataset, demjson, oauth, simplejson, dropbox, errorhandler, feedparser, fluidinfo.py, gdata, geopy, greenlet, gevent, python-gflags, google-api-python-client, googlemaps, html5lib, imposm.parser, jellyfish, mechanize, mock, networkx, ngram, nose, pycrypto, oauthlib, openpyxl, ordereddict, pbkdf2, pdfminer, pexpect, pipe2py, pyOpenSSL, pycurl, pyephem, pyparsing, pyth, python-Levenshtein, python-modargs, distribute, python-stdnum, pytz, rdflib, requests-foauth, selenium, suds, tweepy, tweetstream, w3lib, xlwt, xlutils, xmltodict, lxml, chromium-compact-language-detector, icalendar, pyquery, numpy, scrapely, Fom, Scrapy, adspygoogle.adwords, nltk, pydot, M2Crypto  Running setup.py develop for scraperwiki  Attempting uninstall: pyparsing  Found existing installation: pyparsing 2.4.7  Uninstalling pyparsing-2.4.7:  Successfully uninstalled pyparsing-2.4.7  Running setup.py install for pyparsing: started  Running setup.py install for pyparsing: finished with status 'done'  Running setup.py install for distribute: started  Running setup.py install for distribute: finished with status 'done'  ERROR: After October 2020 you may experience errors when installing or updating packages. This is because pip will change the way that it resolves dependency conflicts.   We recommend you use --use-feature=2020-resolver to test your packages with the new resolver before it becomes the default.   packaging 20.4 requires pyparsing>=2.0.2, but you'll have pyparsing 1.5.6 which is incompatible.  alembic 1.4.2 requires SQLAlchemy>=1.1.0, but you'll have sqlalchemy 0.6.6 which is incompatible.  dataset 0.5.2 requires sqlalchemy>=0.9.1, but you'll have sqlalchemy 0.6.6 which is incompatible.  Successfully installed BeautifulSoup-3.2.0 Creoleparser-0.7.4 Fom-0.9.8 Genshi-0.6 Jinja2-2.6 M2Crypto-0.22.3 Mako-1.1.3 Markdown-2.2.0 MarkupSafe-1.1.1 PyYAML-3.10 Pygments-1.4 SQLAlchemy-0.6.6 Scrapy-0.14.1 Twisted-11.1.0 Unidecode-0.4.9 adspygoogle.adwords-15.6.2 alembic-1.4.2 anyjson-0.3.3 argparse-1.2.1 beautifulsoup4-4.1.3 bitlyapi-0.1.1 blinker-1.2 cartodb-0.6 certifi-0.0.8 chardet-2.1.1 chromium-compact-language-detector-0.31415 ckanclient-0.10 colormath-1.0.8 csvkit-0.3.0 dataset-0.5.2 demjson-1.6 distribute-0.7.3 dropbox-1.4 dumptruck-0.1.6 errorhandler-1.1.1 feedparser-5.0.1 fluidinfo.py-1.1.2 gdata-2.0.15 geopy-0.94.1 gevent-0.13.6 google-api-python-client-1.0b8 googlemaps-1.0.2 greenlet-0.3.2 html5lib-0.90 httplib2-0.7.4 icalendar-3.0.1b1 imposm.parser-1.0.3 jellyfish-0.2.0 lxml-2.3.3 mechanize-0.2.5 mock-0.7.2 networkx-1.6 ngram-3.3.0 nltk-3.0.2 nose-1.1.2 numpy-1.16.6 oauth-1.0.1 oauth2-1.5.170 oauthlib-0.1.2 openpyxl-1.5.7 ordereddict-1.1 pbkdf2-1.3 pdfminer-20110515 pexpect-2.4 pipe2py-0.9.2 pyOpenSSL-0.13 pycrypto-2.5 pycurl-7.19.0 pydot-1.0.2 pyephem-3.7.5.1 pyparsing-1.5.6 pyquery-1.0 pyth-0.5.6 python-Levenshtein-0.10.2 python-dateutil-1.5 python-editor-1.0.4 python-gflags-2.0 python-modargs-1.2 python-slugify-4.0.1 python-stdnum-0.7 pytz-2011k rdflib-3.1.0 requests-1.0.4 requests-foauth-0.1.1 scrapely-0.9 scraperwiki selenium-2.5.0 simplejson-2.2.1 suds-0.4 text-unidecode-1.3 tweepy-1.7.1 tweetstream-1.1.1 w3lib-1.0 xlrd-0.7.1 xlutils-1.4.1 xlwt-0.7.2 xmltodict-0.4 zope.interface-3.8.0   ! Hello! Your requirements.txt file contains the distribute package.  ! This library is automatically installed by Heroku and shouldn't be in  ! Your requirements.txt file. This can cause unexpected behavior.  ! -- Much Love, Heroku. DEPRECATION: Python 2.7 reached the end of its life on January 1st, 2020. Please upgrade your Python as Python 2.7 is no longer maintained. pip 21.0 will drop support for Python 2.7 in January 2021. More details about Python 2 support in pip can be found at https://pip.pypa.io/en/latest/development/release-process/#python-2-support   -----> Downloading NLTK corpora…  ! 'nltk.txt' not found, not downloading any corpora  ! Learn more: https://devcenter.heroku.com/articles/python-nltk  -----> Discovering process types  Procfile declares types -> scraper Injecting scraper and running... Traceback (most recent call last): File "scraper.py", line 93, in <module> html = urllib2.urlopen(url) File "/app/.heroku/python/lib/python2.7/urllib2.py", line 154, in urlopen return opener.open(url, data, timeout) File "/app/.heroku/python/lib/python2.7/urllib2.py", line 435, in open response = meth(req, response) File "/app/.heroku/python/lib/python2.7/urllib2.py", line 548, in http_response 'http', request, response, code, msg, hdrs) File "/app/.heroku/python/lib/python2.7/urllib2.py", line 467, in error result = self._call_chain(*args) File "/app/.heroku/python/lib/python2.7/urllib2.py", line 407, in _call_chain result = func(*args) File "/app/.heroku/python/lib/python2.7/urllib2.py", line 654, in http_error_302 return self.parent.open(new, timeout=req.timeout) File "/app/.heroku/python/lib/python2.7/urllib2.py", line 435, in open response = meth(req, response) File "/app/.heroku/python/lib/python2.7/urllib2.py", line 548, in http_response 'http', request, response, code, msg, hdrs) File "/app/.heroku/python/lib/python2.7/urllib2.py", line 473, in error return self._call_chain(*args) File "/app/.heroku/python/lib/python2.7/urllib2.py", line 407, in _call_chain result = func(*args) File "/app/.heroku/python/lib/python2.7/urllib2.py", line 556, in http_error_default raise HTTPError(req.get_full_url(), code, msg, hdrs, fp) urllib2.HTTPError: HTTP Error 404: Not Found

Data

Downloaded 912 times by SimKennedy woodbine

To download data sign in with GitHub

Download table (as CSV) Download SQLite database (30 KB) Use the API

rows 10 / 53

d f l
2017-02-14 01:26:54.101508
E2721_NYCC_gov_2016_01
2017-02-14 23:12:11.106594
E2721_NYCC_gov_2016_02
2017-02-21 02:16:10.472633
E2721_NYCC_gov_2016_03
2017-02-21 02:16:19.061915
E2721_NYCC_gov_2016_04
2017-07-31 20:39:35.823360
E2721_NYCC_gov_2016_04
2017-08-10 04:45:34.833705
E2721_NYCC_gov_2017_04
2018-07-18 17:19:01.700171
E2721_NYCC_gov_2018_05
2018-08-05 21:27:43.152534
E2721_NYCC_gov_2015_12
2018-08-05 21:27:54.307008
E2721_NYCC_gov_2015_10
2018-08-05 21:28:05.363757
E2721_NYCC_gov_2015_09

Statistics

Average successful run time: 3 minutes

Total run time: 5 days

Total cpu time used: 27 minutes

Total disk space used: 64.7 KB

History

  • Auto ran revision 81637e41 and failed .
    nothing changed in the database
  • Auto ran revision 81637e41 and failed .
    nothing changed in the database
  • Auto ran revision 81637e41 and failed .
    nothing changed in the database
  • Auto ran revision 81637e41 and failed .
    nothing changed in the database
  • Auto ran revision 81637e41 and failed .
    nothing changed in the database
  • ...
  • Created on morph.io

Show complete history

Scraper code

Python

sp_E2721_NYCC_gov / scraper.py