drzax / morph-division-postcode-correspondence

Scrapes AEC for electorate/postcode mapping.


Last run failed with status code 255.

Console output of last run

Injecting configuration and compiling... [1G [1G-----> Node.js app detected [1G [1G-----> Creating runtime environment [1G [1G NPM_CONFIG_LOGLEVEL=error [1G NPM_CONFIG_PRODUCTION=true [1G NPM_CONFIG_CAFILE=/etc/ssl/certs/ca-certificates.crt [1G NODE_VERBOSE=false [1G NODE_ENV=production [1G NODE_TLS_REJECT_UNAUTHORIZED=0 [1G NODE_MODULES_CACHE=true [1G [1G-----> Installing binaries [1G engines.node (package.json): 5.8.0 [1G engines.npm (package.json): 3.8.2 [1G [1G Resolving node version 5.8.0... [1G Downloading and installing node 5.8.0... [1G Bootstrapping npm 3.8.2 (replacing 3.7.3)... [1G npm 3.8.2 installed [1G [1G-----> Restoring cache [1G Skipping cache restore (not-found) [1G [1G-----> Building dependencies [1G Installing node modules (package.json) [1G [1G > sqlite3@4.1.0 install /tmp/build/node_modules/sqlite3 [1G > node-pre-gyp install --fallback-to-build [1G [1G node-pre-gyp ERR! UNCAUGHT EXCEPTION [1G node-pre-gyp ERR! stack TypeError: this is not a typed array. [1G node-pre-gyp ERR! stack at Function.from (native) [1G node-pre-gyp ERR! stack at Unzip.write (/tmp/build/node_modules/minizlib/index.js:277:42) [1G node-pre-gyp ERR! stack at Unpack.write (/tmp/build/node_modules/tar/lib/parse.js:305:58) [1G node-pre-gyp ERR! stack at Request.ondata (stream.js:31:26) [1G node-pre-gyp ERR! stack at emitOne (events.js:90:13) [1G node-pre-gyp ERR! stack at Request.emit (events.js:182:7) [1G node-pre-gyp ERR! stack at IncomingMessage. (/tmp/build/node_modules/request/request.js:1080:12) [1G node-pre-gyp ERR! stack at emitOne (events.js:90:13) [1G node-pre-gyp ERR! stack at IncomingMessage.emit (events.js:182:7) [1G node-pre-gyp ERR! stack at readableAddChunk (_stream_readable.js:153:18) [1G node-pre-gyp ERR! System Linux 5.1.11-x86_64-linode127 [1G node-pre-gyp ERR! command "/tmp/build/.heroku/node/bin/node" "/tmp/build/node_modules/.bin/node-pre-gyp" "install" "--fallback-to-build" [1G node-pre-gyp ERR! cwd /tmp/build/node_modules/sqlite3 [1G node-pre-gyp ERR! node -v v5.8.0 [1G node-pre-gyp ERR! node-pre-gyp -v v0.11.0 [1G node-pre-gyp ERR! This is a bug in `node-pre-gyp`. [1G node-pre-gyp ERR! Try to update node-pre-gyp and file an issue if it does not help: [1G node-pre-gyp ERR! [1G morph-division-postcode-correspondence@1.0.0 /tmp/build [1G +-- cheerio@1.0.0-rc.3 [1G | +-- css-select@1.2.0 [1G | | +-- boolbase@1.0.0 [1G | | +-- css-what@2.1.3 [1G | | +-- domutils@1.5.1 [1G | | `-- nth-check@1.0.2 [1G | +-- dom-serializer@0.1.1 [1G | | `-- domelementtype@1.3.1 [1G | +-- entities@1.1.2 [1G | +-- htmlparser2@3.10.1 [1G | | +-- domhandler@2.4.2 [1G | | +-- inherits@2.0.4 [1G | | `-- readable-stream@3.4.0 [1G | | `-- string_decoder@1.3.0 [1G | +-- lodash@4.17.15 [1G | `-- parse5@3.0.3 [1G | `-- @types/node@12.7.5 [1G +-- clone@1.0.4 [1G +-- queue-async@1.2.1 [1G `-- request@2.88.0 [1G +-- aws-sign2@0.7.0 [1G +-- aws4@1.8.0 [1G +-- caseless@0.12.0 [1G +-- combined-stream@1.0.8 [1G | `-- delayed-stream@1.0.0 [1G +-- extend@3.0.2 [1G +-- forever-agent@0.6.1 [1G +-- form-data@2.3.3 [1G | `-- asynckit@0.4.0 [1G +-- har-validator@5.1.3 [1G | +-- ajv@6.10.2 [1G | | +-- fast-deep-equal@2.0.1 [1G | | +-- fast-json-stable-stringify@2.0.0 [1G | | +-- json-schema-traverse@0.4.1 [1G | | `-- uri-js@4.2.2 [1G | | `-- punycode@2.1.1 [1G | `-- har-schema@2.0.0 [1G +-- http-signature@1.2.0 [1G | +-- assert-plus@1.0.0 [1G | +-- jsprim@1.4.1 [1G | | +-- extsprintf@1.3.0 [1G | | +-- json-schema@0.2.3 [1G | | `-- verror@1.10.0 [1G | | `-- core-util-is@1.0.2 [1G | `-- sshpk@1.16.1 [1G | +-- asn1@0.2.4 [1G | +-- bcrypt-pbkdf@1.0.2 [1G | +-- dashdash@1.14.1 [1G | +-- ecc-jsbn@0.1.2 [1G | +-- getpass@0.1.7 [1G | +-- jsbn@0.1.1 [1G | +-- safer-buffer@2.1.2 [1G | `-- tweetnacl@0.14.5 [1G +-- is-typedarray@1.0.0 [1G +-- isstream@0.1.2 [1G +-- json-stringify-safe@5.0.1 [1G +-- mime-types@2.1.24 [1G | `-- mime-db@1.40.0 [1G +-- oauth-sign@0.9.0 [1G +-- performance-now@2.1.0 [1G +-- qs@6.5.2 [1G +-- safe-buffer@5.2.0 [1G +-- tough-cookie@2.4.3 [1G | +-- psl@1.4.0 [1G | `-- punycode@1.4.1 [1G +-- tunnel-agent@0.6.0 [1G `-- uuid@3.3.3 [1G [1G npm ERR! Linux 5.1.11-x86_64-linode127 [1G npm ERR! argv "/tmp/build/.heroku/node/bin/node" "/tmp/build/.heroku/node/bin/npm" "install" "--unsafe-perm" "--userconfig" "/tmp/build/.npmrc" [1G npm ERR! node v5.8.0 [1G npm ERR! npm v3.8.2 [1G npm ERR! code ELIFECYCLE [1G [1G npm ERR! sqlite3@4.1.0 install: `node-pre-gyp install --fallback-to-build` [1G npm ERR! Exit status 7 [1G npm ERR! [1G npm ERR! Failed at the sqlite3@4.1.0 install script 'node-pre-gyp install --fallback-to-build'. [1G npm ERR! Make sure you have the latest version of node.js and npm installed. [1G npm ERR! If you do, this is most likely a problem with the sqlite3 package, [1G npm ERR! not with npm itself. [1G npm ERR! Tell the author that this fails on your system: [1G npm ERR! node-pre-gyp install --fallback-to-build [1G npm ERR! You can get information on how to open an issue for this project with: [1G npm ERR! npm bugs sqlite3 [1G npm ERR! Or if that isn't available, you can get their info via: [1G npm ERR! npm owner ls sqlite3 [1G npm ERR! There is likely additional logging output above. [1G [1G npm ERR! Please include the following file with any support request: [1G npm ERR! /tmp/build/npm-debug.log [1G [1G-----> Build failed [1G [1G We're sorry this build is failing! You can troubleshoot common issues here: [1G https://devcenter.heroku.com/articles/troubleshooting-node-deploys [1G [1G If you're stuck, please submit a ticket so we can help: [1G https://help.heroku.com/ [1G [1G Love, [1G Heroku [1G

Data

Downloaded 43 times by henare openaustralia MikeRalphson jhewitt86 Milliners-Son szavarce bdlt mgburke2 Nigel78 matthew-robert-hurst djkencloud WilliamYun kelpenhagen Amleeson alakaboo maxious metacoretechs nyssajayne ldw77 acidin

To download data sign in with GitHub

Download table (as CSV) Download SQLite database (833 KB) Use the API

rows 10 / 21087

state suburb postcode electorate redistributedElectorate otherLocalities
VIC
BAYSWATER
3153
Aston
VIC
BORONIA
3155
Aston
VIC
MOUNTAIN GATE
3156
Aston
FERNTREE GULLY
VIC
ROWVILLE
3178
Aston
VIC
SCORESBY
3179
Aston
VIC
STUDFIELD
3152
Aston
WANTIRNA SOUTH
VIC
THE BASIN
3154
Aston
VIC
WANTIRNA
3152
Aston
VIC
WANTIRNA SOUTH
3152
Aston
VIC
KNOXFIELD
3180
Aston

Statistics

Average successful run time: about 12 hours

Total run time: 1 day

Total cpu time used: 24 minutes

Total disk space used: 861 KB

History

  • Manually ran revision f8876406 and failed .
    nothing changed in the database
  • Manually ran revision f8876406 and completed successfully .
    11889 records removed, 20839 records updated in the database
  • Manually ran revision bc60a6b6 and completed successfully .
    21087 records added in the database
  • Manually ran revision 99c57191 and failed .
    11889 records added in the database
  • Created on morph.io