This is a scraper that runs on Morph. To get started see the documentation

Contributors Mraleksa

Last run failed with status code 255.

Console output of last run

Injecting configuration and compiling...  -----> Node.js app detected  -----> Creating runtime environment   NPM_CONFIG_LOGLEVEL=error  NPM_CONFIG_PRODUCTION=true  NPM_CONFIG_CAFILE=/etc/ssl/certs/ca-certificates.crt  NODE_VERBOSE=false  NODE_ENV=production  NODE_TLS_REJECT_UNAUTHORIZED=0  NODE_MODULES_CACHE=true  -----> Installing binaries  engines.node (package.json): unspecified  engines.npm (package.json): unspecified (use default)   Resolving node version 6.x...  Downloading and installing node 6.17.1...  Using default npm version: 3.10.10  -----> Restoring cache  Skipping cache restore (not-found)  -----> Building dependencies  Installing node modules (package.json)   > sqlite3@5.1.1 install /tmp/build/node_modules/sqlite3  > node-pre-gyp install --fallback-to-build   node-pre-gyp ERR! UNCAUGHT EXCEPTION  node-pre-gyp ERR! stack /tmp/build/node_modules/detect-libc/lib/detect-libc.js:76  node-pre-gyp ERR! stack const family = async () => {  node-pre-gyp ERR! stack ^  node-pre-gyp ERR! stack  node-pre-gyp ERR! stack SyntaxError: Unexpected token (  node-pre-gyp ERR! stack at createScript (vm.js:56:10)  node-pre-gyp ERR! stack at Object.runInThisContext (vm.js:97:10)  node-pre-gyp ERR! stack at Module._compile (module.js:549:28)  node-pre-gyp ERR! stack at Object.Module._extensions..js (module.js:586:10)  node-pre-gyp ERR! stack at Module.load (module.js:494:32)  node-pre-gyp ERR! stack at tryModuleLoad (module.js:453:12)  node-pre-gyp ERR! stack at Function.Module._load (module.js:445:3)  node-pre-gyp ERR! stack at Module.require (module.js:504:17)  node-pre-gyp ERR! stack at require (internal/module.js:20:19)  node-pre-gyp ERR! stack at Object.<anonymous> (/tmp/build/node_modules/@mapbox/node-pre-gyp/lib/util/versioning.js:8:21)  node-pre-gyp ERR! System Linux 5.12.2-x86_64-linode144  node-pre-gyp ERR! command "/tmp/build/.heroku/node/bin/node" "/tmp/build/node_modules/.bin/node-pre-gyp" "install" "--fallback-to-build"  node-pre-gyp ERR! cwd /tmp/build/node_modules/sqlite3  node-pre-gyp ERR! node -v v6.17.1  node-pre-gyp ERR! node-pre-gyp -v v1.0.10  @0.0.1 /tmp/build  +-- d3@7.6.1  | +-- d3-array@3.2.0  | | `-- internmap@2.0.3  | +-- d3-axis@3.0.0  | +-- d3-brush@3.0.0  | +-- d3-chord@3.0.1  | +-- d3-color@3.1.0  | +-- d3-contour@4.0.0  | +-- d3-delaunay@6.0.2  | | `-- delaunator@5.0.0  | | `-- robust-predicates@3.0.1  | +-- d3-dispatch@3.0.1  | +-- d3-drag@3.0.0  | +-- d3-dsv@3.0.1  | | +-- commander@7.2.0  | | +-- iconv-lite@0.6.3  | | | `-- safer-buffer@2.1.2  | | `-- rw@1.3.3  | +-- d3-ease@3.0.1  | +-- d3-fetch@3.0.1  | +-- d3-force@3.0.0  | +-- d3-format@3.1.0  | +-- d3-geo@3.0.1  | +-- d3-hierarchy@3.1.2  | +-- d3-interpolate@3.0.1  | +-- d3-path@3.0.1  | +-- d3-polygon@3.0.1  | +-- d3-quadtree@3.0.1  | +-- d3-random@3.0.1  | +-- d3-scale@4.0.2  | +-- d3-scale-chromatic@3.0.0  | +-- d3-selection@3.0.0  | +-- d3-shape@3.1.0  | +-- d3-time@3.0.0  | +-- d3-time-format@4.1.0  | +-- d3-timer@3.0.1  | +-- d3-transition@3.0.1  | `-- d3-zoom@3.0.0  `-- http-api-client@0.1.8  `-- promise@5.0.0  `-- asap@1.0.0   npm ERR! Linux 5.12.2-x86_64-linode144  npm ERR! argv "/tmp/build/.heroku/node/bin/node" "/tmp/build/.heroku/node/bin/npm" "install" "--unsafe-perm" "--userconfig" "/tmp/build/.npmrc"  npm ERR! node v6.17.1  npm ERR! npm v3.10.10  npm ERR! code ELIFECYCLE   npm ERR! sqlite3@5.1.1 install: `node-pre-gyp install --fallback-to-build`  npm ERR! Exit status 7  npm ERR!  npm ERR! Failed at the sqlite3@5.1.1 install script 'node-pre-gyp install --fallback-to-build'.  npm ERR! Make sure you have the latest version of node.js and npm installed.  npm ERR! If you do, this is most likely a problem with the sqlite3 package,  npm ERR! not with npm itself.  npm ERR! Tell the author that this fails on your system:  npm ERR! node-pre-gyp install --fallback-to-build  npm ERR! You can get information on how to open an issue for this project with:  npm ERR! npm bugs sqlite3  npm ERR! Or if that isn't available, you can get their info via:  npm ERR! npm owner ls sqlite3  npm ERR! There is likely additional logging output above.   npm ERR! Please include the following file with any support request:  npm ERR! /tmp/build/npm-debug.log  -----> Build failed   We're sorry this build is failing! You can troubleshoot common issues here:  https://devcenter.heroku.com/articles/troubleshooting-node-deploys   Some possible problems:   - Node version not specified in package.json  https://devcenter.heroku.com/articles/nodejs-support#specifying-a-node-js-version   Love,  Heroku 

Data

Downloaded 76353 times by Mraleksa quazerro

To download data sign in with GitHub

Download table (as CSV) Download SQLite database (184 MB) Use the API

rows 10 / 412580

dateModified id dateSigned first tenderID procuringEntity numberOfBids startAmount amount save cpv region up down downDate upDates
2017-01-01T11:18:57.129618+02:00
417b878fe8d14532a28f761e88af6200
2016-09-28T13:00:00+03:00
UA-2016-08-22-000847-c
НАЦІОНАЛЬНА ТЕЛЕКОМПАНІЯ УКРАЇНИ (ФІЛІЯ НАЦІОНАЛЬНОЇ ТЕЛЕКОМПАНІЇ УКРАЇНИ "ЛЬВІВСЬКА РЕГІОНАЛЬНА ДИРЕКЦІЯ"
4
570743
492804
14
Природний газ
Львовская область
3
0
undefined;undefined;2016-12-05T11:00:00+02:00;
2017-01-02T16:49:40.106268+02:00
eb22cde7b26e46bc8025fcae5b25988b
2016-09-06T00:00:00+03:00
UA-2016-07-20-000469-b
ФІЛІЯ «ПІВДЕННО-ЗАХІДНА ЗАЛІЗНИЦЯ» ПАТ «УКРЗАЛІЗНИЦЯ»
4
825774
709950
14
Частини локомотивів чи рухомого складу
Київська обл.
1
0
undefined;
2017-01-02T17:45:48.994560+02:00
330f04617c634f979312ae6d7575e97c
2016-11-16T00:00:00+02:00
UA-2016-10-20-000474-a
ВІЙСЬКОВА ЧАСТИНА 1471
1
1890000
1884963
0
Продуктові набори
Київська обл.
1
0
undefined;
2017-01-02T22:18:35.992965+02:00
581ea70dccf648fe97a450b1c4130be5
2016-11-15T23:59:59+02:00
2016-12-28T10:23:36+02:00
UA-2016-11-08-000638-c
УПРАВЛІННЯ ДЕРЖАВНОЇ МІГРАЦІЙНОЇ СЛУЖБИ УКРАЇНИ В ПОЛТАВСЬКІЙ ОБЛАСТІ
1
5945
5945
0
Пара, гаряча вода та пов’язана продукція
Полтавська область
1
0
2016-12-28T10:23:36+02:00;
2017-01-03T01:08:04.253658+02:00
2e6c56362a7f4d56b1cfd7daed5d787f
2016-11-07T23:59:59+02:00
UA-2016-10-24-000880-b
ВІДДІЛ ОСВІТИ ТИСМЕНИЦЬКОЇ РАЙОННОЇ ДЕРЖАВНОЇ АДМІНІСТРАЦІЇ
1
233653
233653
0
Природний газ
Івано-Франківська область
1
0
undefined;
2017-01-03T01:03:04.041883+02:00
b2967728d1074154907d8ce106b24a21
2016-11-07T23:59:59+02:00
UA-2016-10-24-000966-b
ВІДДІЛ ОСВІТИ ТИСМЕНИЦЬКОЇ РАЙОННОЇ ДЕРЖАВНОЇ АДМІНІСТРАЦІЇ
1
1303528
1303528
0
Природний газ
Івано-Франківська область
1
0
undefined;
2017-01-03T08:31:06.490964+02:00
e9803074dd27420aa0d2a240f69ba933
2016-10-27T23:59:59+03:00
UA-2016-09-20-000091-b
АВАРІЙНО-РЯТУВАЛЬНИЙ ЗАГІН СПЕЦІАЛЬНОГО ПРИЗНАЧЕННЯ УПРАВЛІННЯ ДСНС УКРАЇНИ У ЧЕРНІВЕЦЬКІЙ ОБЛАСТІ
4
3520000
3185242
10
Нафта і дистиляти
Чернівецька область
1
0
undefined;
2017-01-03T08:39:46.288840+02:00
c58211a933a24626b012032a0ac3008f
2016-11-29T09:00:00+02:00
2016-12-13T09:32:59.534397+02:00
UA-2016-10-25-000218-a
НАЦІОНАЛЬНИЙ УНІВЕРСИТЕТ "ЛЬВІВСЬКА ПОЛІТЕХНІКА"
3
700000
442600
37
Нафта і дистиляти
Львівська область
2
0
2016-12-13T09:32:59.534397+02:00;2016-12-27T15:00:00+02:00;
2017-01-03T08:33:35.765711+02:00
30b9c3be1fcb46ff86ff0b8c215fcef4
2016-11-14T09:00:00+02:00
2016-12-14T10:00:00+02:00
UA-2016-10-06-000294-b
ХЕРСОНСЬКА ДЕРЖАВНА МОРСЬКА АКАДЕМІЯ
3
101000
75730
25
Картопля та сушені овочі
Херсонська область
1
0
2016-12-14T10:00:00+02:00;
2017-01-03T08:38:45.094133+02:00
49df46c684764a79be7bc81009557d17
2016-12-05T00:00:00+02:00
2016-12-12T10:51:45.178870+02:00
UA-2016-10-26-000803-a
КОМУНАЛЬНИЙ ЗАКЛАД "ЧЕРКАСЬКИЙ ОБЛАСНИЙ ГОСПІТАЛЬ ВЕТЕРАНІВ ВІЙНИ ЧЕРКАСЬКОЇ ОБЛАСНОЇ РАДИ"
2
135000
126540
6
Фармацевтична продукція
Черкаська область
2
0
2016-12-12T10:51:45.178870+02:00;2016-12-12T11:10:46.567522+02:00;

Statistics

Average successful run time: 26 minutes

Total run time: 3 months

Total cpu time used: 3 days

Total disk space used: 184 MB

History

  • Auto ran revision ca80b66a and failed .
    nothing changed in the database
  • Auto ran revision ca80b66a and failed .
    nothing changed in the database
  • Auto ran revision ca80b66a and failed .
    nothing changed in the database
  • Auto ran revision ca80b66a and failed .
    nothing changed in the database
  • Auto ran revision ca80b66a and failed .
    nothing changed in the database
  • ...
  • Created on morph.io

Show complete history

Scraper code

Node.js

amendmetsTest / scraper.js